Pent-1-yn-3-one
- Formula: C5H6O
- Molecular weight: 82.1005
- IUPAC Standard InChIKey: GBCOTHPVQOTZKQ-UHFFFAOYSA-N
- CAS Registry Number: 16469-62-8
- Chemical structure:
View 3d structure (requires JavaScript / HTML 5) - Other names: 1-Pentyne-3-one

Gas phase ion energetics data

Data compiled by: Sharon G. Lias, Rhoda D. Levin, and Sherif A. Kafafi
Ionization energy determinations
IE (eV) | Method | Reference | Comment |
---|---|---|---|
10.03 | PE | Carlier and Mouvier, 1979 | Vertical value |

References

Carlier and Mouvier, 1979
Carlier, P.; Mouvier, G.,
Etude par spectrometrie de photoelectrons de la structure electronique des ynals et des ynones conjugues,
J. Electron Spectrosc. Relat. Phenom., 1979, 17, 169. [all data]