1,1,1,3,3,3-hexafluoroisopropylideneamine
- Formula: C3HF6N
- Molecular weight: 165.0372
- CAS Registry Number: 1645-75-6

Gas phase ion energetics data

Data compiled by: Sharon G. Lias, Rhoda D. Levin, and Sherif A. Kafafi
Ionization energy determinations
IE (eV) | Method | Reference | Comment |
---|---|---|---|
11.8 | PE | Vocelle, Dargelos, et al., 1977 | Vertical value |

References

Vocelle, Dargelos, et al., 1977
Vocelle, D.; Dargelos, A.; Pottier, R.; Sandorfy, C.,
Photoelectron and far-ultraviolet absorption spectra of nonaromatic azomethine compounds,
J. Chem. Phys., 1977, 66, 2860. [all data]