4,6-Decadiyne
- Formula: C10H14
- Molecular weight: 134.2182
- IUPAC Standard InChIKey: LIWZSNTUMSGWTF-UHFFFAOYSA-N
- CAS Registry Number: 16387-71-6
- Chemical structure:
View 3d structure (requires JavaScript / HTML 5) - Permanent link for this species. Use this link for bookmarking this species for future reference.

Phase change data

Data compiled by: Robert L. Brown and Stephen E. Stein
Reduced pressure boiling point
Tboil (K) | Pressure (bar) | Reference |
---|---|---|
349. | 0.003 | Farchan Laboratories, 1990 |
361. | 0.016 | Farchan Laboratories, 1990 |

Gas phase ion energetics data

Data compiled by: Sharon G. Lias, Rhoda D. Levin, and Sherif A. Kafafi
Ionization energy determinations
IE (eV) | Method | Reference |
---|---|---|
8.72 | PE | Heilbronner, Jones, et al., 1977 |

References

Farchan Laboratories, 1990
Farchan Laboratories,
Research Chemicals Catalog, Farchan Laboratories, Gainesville, FL, 1990, 91. [all data]
Heilbronner, Jones, et al., 1977
Heilbronner, E.; Jones, T.B.; Maier, J.P.,
170. The ionization energies of di-n-alkyl diacetylenes,
Helv. Chim. Acta, 1977, 60, 1697. [all data]