3,5-Octadiyne
- Formula: C8H10
- Molecular weight: 106.1650
- IUPAC Standard InChIKey: LILZEAJBVQOINI-UHFFFAOYSA-N
- CAS Registry Number: 16387-70-5
- Chemical structure:
View 3d structure (requires JavaScript / HTML 5) - Other names: Diethyldiacetylene

Phase change data

Data compiled by: Thermodynamics Research Center, NIST Boulder Laboratories, Chris Muzny director
Quantity | Value | Units | Method | Reference | Comment |
---|---|---|---|---|---|
Tboil | 437. | K | N/A | Dupont, 1909 | Uncertainty assigned by TRC = 4. K |

Gas phase ion energetics data

Data compiled by: Sharon G. Lias, Rhoda D. Levin, and Sherif A. Kafafi
Ionization energy determinations
IE (eV) | Method | Reference | Comment |
---|---|---|---|
8.55 | PE | Maier, Misev, et al., 1981 | |
8.78 | PE | Heilbronner, Jones, et al., 1977 | |
8.82 | PE | Maier, Misev, et al., 1981 | Vertical value |

Normal alkane RI, non-polar column, custom temperature program

Column type | Active phase | I | Reference | Comment |
---|---|---|---|---|
Capillary | Methyl Silicone | 972. | Zenkevich, 1998 | Program: not specified |

References

Dupont, 1909
Dupont, G.,
C. R. Hebd. Seances Acad. Sci., 1909, 148, 1522. [all data]
Maier, Misev, et al., 1981
Maier, J.P.; Misev, L.; Thommen, F.,
191. Laser-induced fluorescence and photoelectron-photon coincidence studies of 3,5-octadiyne cation,
Helv. Chim. Acta, 1981, 64, 1985. [all data]
Heilbronner, Jones, et al., 1977
Heilbronner, E.; Jones, T.B.; Maier, J.P.,
170. The ionization energies of di-n-alkyl diacetylenes,
Helv. Chim. Acta, 1977, 60, 1697. [all data]
Zenkevich, 1998
Zenkevich, I.G.,
Non-Traditional Criteria for Gas-Chromatographic and Chromato-Mass-Spectrometric Identification of Organic Compounds,
Zh. Anal. Khim., 1998, 53, 8, 828-835. [all data]