2,3-Diethyl-1,3-butadiene
- Formula: C8H14
- Molecular weight: 110.1968
- IUPAC Standard InChIKey: OAOZZYBUAWEDRA-UHFFFAOYSA-N
- CAS Registry Number: 16356-05-1
- Chemical structure:
View 3d structure (requires JavaScript / HTML 5) - Permanent link for this species. Use this link for bookmarking this species for future reference.

Phase change data

Data compiled by: Thermodynamics Research Center, NIST Boulder Laboratories, Chris Muzny director
Quantity | Value | Units | Method | Reference | Comment |
---|---|---|---|---|---|
Tboil | 392.15 | K | N/A | Reeve and Reichel, 1972 | Uncertainty assigned by TRC = 1.5 K |
Tboil | 399.5 | K | N/A | Gostunskaya, Krasnyanskaya, et al., 1955 | Uncertainty assigned by TRC = 2. K |

Gas phase ion energetics data

Data compiled as indicated in comments:
LLK - Sharon G. Lias, Rhoda D. Levin, and Sherif A. Kafafi
Ionization energy determinations
IE (eV) | Method | Reference | Comment |
---|---|---|---|
8.58 | PE | Masclet, Mouvier, et al., 1981 | Vertical value; LLK |

References

Reeve and Reichel, 1972
Reeve, W.; Reichel, D.M.,
Dehydration of 3,4-Dimethyl-3-hexanediol to the Six Possible C8H14 Dienes and Proof of Structure of the Substituted Btadienes,
J. Org. Chem., 1972, 37, 68. [all data]
Gostunskaya, Krasnyanskaya, et al., 1955
Gostunskaya, I.V.; Krasnyanskaya, E.A.; Kazanskii, B.A.,
Zh. Obshch. Khim., 1955, 25, 1448. [all data]
Masclet, Mouvier, et al., 1981
Masclet, P.; Mouvier, G.; Bocquet, J.F.,
Effets electroniques et effets steriques dus a la substitution alcoyle dans les dienes conjugues,
J. Chim. Phys., 1981, 78, 99. [all data]