Naphthalene, 1-butyl-
- Formula: C14H16
- Molecular weight: 184.2768
- IUPAC Standard InChIKey: URGSMJLDEFDWNX-UHFFFAOYSA-N
- CAS Registry Number: 1634-09-9
- Chemical structure:
View 3d structure (requires JavaScript / HTML 5) - Other names: α-Butylnaphthalene; 1-Butylnaphthalene; 1-Naphthyl-1-butane; 1-n-Butylnaphthalene

Condensed phase thermochemistry data

Data compiled by: Hussein Y. Afeefy, Joel F. Liebman, and Stephen E. Stein
Quantity | Value | Units | Method | Reference | Comment |
---|---|---|---|---|---|
ΔcH°liquid | -7427. | kJ/mol | Ccb | Hipsher and Wise, 1954 | ΔHfusion=6.0 kcal/mol; Corresponding ΔfHºliquid = -370. kJ/mol (simple calculation by NIST; no Washburn corrections) |

Phase change data

Data compiled as indicated in comments:
BS - Robert L. Brown and Stephen E. Stein
TRC - Thermodynamics Research Center, NIST Boulder Laboratories, Chris Muzny director
Quantity | Value | Units | Method | Reference | Comment |
---|---|---|---|---|---|
Tboil | 560. ± 6. | K | AVG | N/A | Average of 11 values; Individual data points |
Quantity | Value | Units | Method | Reference | Comment |
Tfus | 253.39 | K | N/A | Hipsher and Wise, 1954, 2 | Uncertainty assigned by TRC = 0.2 K; TRC |
Tfus | 250. | K | N/A | Bailey, Pickering, et al., 1949 | Uncertainty assigned by TRC = 4. K; TRC |
Tfus | 207. | K | N/A | Andreev, 1947 | Uncertainty assigned by TRC = 5. K; TRC |

Gas phase ion energetics data

Data compiled by: Sharon G. Lias, Rhoda D. Levin, and Sherif A. Kafafi
Ionization energy determinations
IE (eV) | Method | Reference |
---|---|---|
7.76 | PE | Berkowitz, Dehmer, et al., 1973 |

Kovats' RI, non-polar column, isothermal

Column type | Active phase | Temperature (C) | I | Reference | Comment |
---|---|---|---|---|---|
Packed | OV-1 | 150. | 1562. | Antal, 1984 | Chromosorb W HP; Column length: 2.5 m |
Packed | OV-3 | 150. | 1604. | Antal, 1984 | Chromosorb W HP; Column length: 2.5 m |
Capillary | OV-1 | 130. | 1555. | Engewald, Wennrich, et al., 1979 | Column length: 50. m; Column diameter: 0.23 mm |

Normal alkane RI, non-polar column, custom temperature program

Column type | Active phase | I | Reference | Comment |
---|---|---|---|---|
Capillary | OV-1, SE-30, Methyl silicone, SP-2100, OV-101, DB-1, etc. | 1555. | Waggott and Davies, 1984 | Hydrogen; Column length: 50. m; Column diameter: 0.32 mm; Program: not specified |

References

Hipsher and Wise, 1954
Hipsher, H.F.; Wise, P.H.,
Dicyclic hydrocarbons. VIII. 1-Alkylnaphthalenes and some of their tetrahydro derivatives,
J. Am. Chem. Soc., 1954, 76, 1747-1748. [all data]
Hipsher and Wise, 1954, 2
Hipsher, H.F.; Wise, P.H.,
Dicyclic Hydrocarbons VIII. 1-Alkylnaphthalenes and Some of Their Tetrahydro Derivatives,
J. Am. Chem. Soc., 1954, 76, 1747-8. [all data]
Bailey, Pickering, et al., 1949
Bailey, A.S.; Pickering, G.B.; Smith, J.C.,
Alkylnaphthalenes: III the n-butyl, amyl, and hexylnaphthalenes,
J. Inst. Pet., 1949, 35, 103-17. [all data]
Andreev, 1947
Andreev, D.N.,
Synthesis of Alkylnaphthalenes by Means of Organilithium Compounds,
Zh. Obshch. Khim., 1947, 17, 1645-50. [all data]
Berkowitz, Dehmer, et al., 1973
Berkowitz, J.; Dehmer, J.L.; Shimada, K.; Szwarc, M.,
Photoelectron spectroscopic studies of (α-naphthyl)-(CH2)4-(α-naphthyl) vapor: open chain or cyclic conformation?,
J. Electron Spectrosc. Relat. Phenom., 1973, 2, 211. [all data]
Antal, 1984
Antal, J.,
Adatok az alkil-naftalinok gáz-folyadék kromatográfiájához, I.,
Magy. Kem. Foly., 1984, 90, 121-125. [all data]
Engewald, Wennrich, et al., 1979
Engewald, W.; Wennrich, L.; Ritter, E.,
Molekülstruktur und Retentionsverhalten. XII. Zur Retention von Alkylnaphthalinen Bei der Gasverteilungs- und Gas-Adsorptions-Chromatographie,
J. Chromatogr., 1979, 174, 2, 315-323, https://doi.org/10.1016/S0021-9673(00)86005-7
. [all data]
Waggott and Davies, 1984
Waggott, A.; Davies, I.W.,
Identification of organic pollutants using linear temperature programmed retention indices (LTPRIs) - Part II, 1984, retrieved from http://dwi.defra.gov.uk/research/completed-research/reports/dwi0383.pdf. [all data]