[2.2]Paracyclophane
- Formula: C16H16
- Molecular weight: 208.2982
- IUPAC Standard InChIKey: OOLUVSIJOMLOCB-UHFFFAOYSA-N
- CAS Registry Number: 1633-22-3
- Chemical structure:
View 3d structure (requires JavaScript / HTML 5) - Other names: Tricyclo[8.2.2.2(4,7)]hexadeca-4,6,10,12,13,15-hexaene; Cyclobis(benzene-1,4-dimethylene); Di-p-xylylene; Di-1,4-xylylene; tricyclo[8.2.2.24,7]hexadeca-1(12),4,6,10,13,15-hexaene

Gas phase thermochemistry data

Data compiled by: Hussein Y. Afeefy, Joel F. Liebman, and Stephen E. Stein
Quantity | Value | Units | Method | Reference | Comment |
---|---|---|---|---|---|
ΔfH°gas | 244.7 ± 2.1 | kJ/mol | Ccb | Nishiyama, Sakiyama, et al., 1980 | Reanalyzed by Cox and Pilcher, 1970, Original value = 246.3 ± 3.3 kJ/mol |
ΔfH°gas | 241. ± 4.2 | kJ/mol | Ccb | Rodgers, Westrum, et al., 1973 | |
ΔfH°gas | 241.3 ± 4.3 | kJ/mol | Ccb | Boyd, 1966 | Reanalyzed by Cox and Pilcher, 1970, Original value = 251. ± 7.9 kJ/mol |

Condensed phase thermochemistry data

Data compiled as indicated in comments:
ALS - Hussein Y. Afeefy, Joel F. Liebman, and Stephen E. Stein
DH - Eugene S. Domalski and Elizabeth D. Hearing
Quantity | Value | Units | Method | Reference | Comment |
---|---|---|---|---|---|
ΔfH°solid | 146.7 ± 2.8 | kJ/mol | Ccb | Nishiyama, Sakiyama, et al., 1980 | ALS |
ΔfH°solid | 144.7 ± 0.88 | kJ/mol | Ccb | Rodgers, Westrum, et al., 1973 | ALS |
ΔfH°solid | 154. ± 4. | kJ/mol | Ccb | Boyd, 1966 | ALS |
Quantity | Value | Units | Method | Reference | Comment |
ΔcH°solid | -8729.5 ± 1.8 | kJ/mol | Ccb | Nishiyama, Sakiyama, et al., 1980 | Corresponding ΔfHºsolid = 146.68 kJ/mol (simple calculation by NIST; no Washburn corrections); ALS |
ΔcH°solid | -8727.57 ± 0.63 | kJ/mol | Ccb | Rodgers, Westrum, et al., 1973 | Corresponding ΔfHºsolid = 144.8 kJ/mol (simple calculation by NIST; no Washburn corrections); ALS |
ΔcH°solid | -8737. ± 4. | kJ/mol | Ccb | Boyd, 1966 | Corresponding ΔfHºsolid = 154. kJ/mol (simple calculation by NIST; no Washburn corrections); ALS |
Quantity | Value | Units | Method | Reference | Comment |
S°solid,1 bar | 265.68 | J/mol*K | N/A | Andrews and Westrum, 1970 | DH |
Constant pressure heat capacity of solid
Cp,solid (J/mol*K) | Temperature (K) | Reference | Comment |
---|---|---|---|
252.7 | 298.15 | Rodgers, Westrum, et al., 1973 | Cp given as 0.290 cal/g*K.; DH |
252.34 | 298.15 | Andrews and Westrum, 1970 | T = 10 to 350 K.; DH |
248.1 | 300. | Shieh, McNally, et al., 1969 | T = 300, 318 K.; DH |

Phase change data

Data compiled as indicated in comments:
DRB - Donald R. Burgess, Jr.
ALS - Hussein Y. Afeefy, Joel F. Liebman, and Stephen E. Stein
AC - William E. Acree, Jr., James S. Chickos
Quantity | Value | Units | Method | Reference | Comment |
---|---|---|---|---|---|
ΔsubH° | 98.0 | kJ/mol | N/A | Nishiyama, Sakiyama, et al., 1980 | DRB |
ΔsubH° | 96.2 ± 4.2 | kJ/mol | V | Rodgers, Westrum, et al., 1973 | ALS |
ΔsubH° | 96.3 | kJ/mol | N/A | Rodgers, Westrum, et al., 1973 | DRB |
ΔsubH° | 96.2 ± 4.2 | kJ/mol | V | Boyd, 1966 | ALS |
ΔsubH° | 87.3 | kJ/mol | N/A | Boyd, 1966 | DRB |
Enthalpy of sublimation
ΔsubH (kJ/mol) | Temperature (K) | Method | Reference | Comment |
---|---|---|---|---|
99.6 ± 1.8 | 381.4 | V | Nishiyama, Sakiyama, et al., 1980 | ALS |
96.4 ± 1.5 | 353. to 409. | TSGC | Nishiyama, Sakiyama, et al., 1980 | AC |
92.9 ± 0.84 | 363. | ME | Boyd, 1966 | Based on data from 343. to 383. K. See also Stephenson and Malanowski, 1987 and Cox and Pilcher, 1970, 2.; AC |
Enthalpy of fusion
ΔfusH (kJ/mol) | Temperature (K) | Reference | Comment |
---|---|---|---|
0.21 | 323.2 | Andrews and Westrum, 1970, 2 | AC |

Gas phase ion energetics data

Data compiled as indicated in comments:
LBLHLM - Sharon G. Lias, John E. Bartmess, Joel F. Liebman, John L. Holmes, Rhoda D. Levin, and W. Gary Mallard
LLK - Sharon G. Lias, Rhoda D. Levin, and Sherif A. Kafafi
Ionization energy determinations
IE (eV) | Method | Reference | Comment |
---|---|---|---|
7.8 | PE | Gleiter, Eckert-Maksic, et al., 1982 | LBLHLM |
7.8 | PE | Kovac, Mohraz, et al., 1980 | LLK |
7.60 | PE | Heilbronner and Maier, 1974 | LLK |
~7.8 | PI | Pignataro, Mancini, et al., 1971 | LLK |
8.2 | PE | Gleiter, Eckert-Maksic, et al., 1982 | Vertical value; LBLHLM |
8.10 | PE | Zhong-zhi, Kovak, et al., 1981 | Vertical value; LLK |
8.10 | PE | Kovac, Allan, et al., 1980 | Vertical value; LLK |
8.00 | PE | Koenig, Wielesek, et al., 1975 | Vertical value; LLK |
8.08 | PE | Boschi and Schmidt, 1973 | Vertical value; LLK |

References

Nishiyama, Sakiyama, et al., 1980
Nishiyama, K.; Sakiyama, N.; Seki, S.; Horita, H.; Otsubo, T.; Misumi, S.,
Thermochemical studies on double- and triple-layered [2.2]paracyclophanes. Estimation of molecular strain energies.,
Bull. Chem. Soc. Jpn., 1980, 53, 869-877. [all data]
Cox and Pilcher, 1970
Cox, J.D.; Pilcher, G.,
Thermochemistry of Organic and Organometallic Compounds, Academic Press, New York, 1970, 1-636. [all data]
Rodgers, Westrum, et al., 1973
Rodgers, D.L.; Westrum, E.F., Jr.; Andrews, J.T.S.,
The enthalpies of combustion and formation of [2.2]-paracyclophane and triptycene,
J. Chem. Thermodyn., 1973, 5, 733-739. [all data]
Boyd, 1966
Boyd, R.H.,
The heat of combustion and strain energy of 2,2-paracyclophane,
Tetrahedron, 1966, 22, 119-122. [all data]
Andrews and Westrum, 1970
Andrews, J.T.S.; Westrum, E.F., Jr.,
The heat capacity and thermodynamic functions of crystalline and liquid triptycene,
J. Chem. Thermodynam., 1970, 2, 245-253. [all data]
Shieh, McNally, et al., 1969
Shieh, C.; McNally, D.; Boyd, R.H.,
The heats of combustion and strain energies of some cyclophanes,
Tetrahedron, 1969, 3653-3665. [all data]
Stephenson and Malanowski, 1987
Stephenson, Richard M.; Malanowski, Stanislaw,
Handbook of the Thermodynamics of Organic Compounds, 1987, https://doi.org/10.1007/978-94-009-3173-2
. [all data]
Cox and Pilcher, 1970, 2
Cox, J.D.; Pilcher, G.,
Thermochemistry of Organic and Organometallic Compounds, Academic Press Inc., London, 1970, 643. [all data]
Andrews and Westrum, 1970, 2
Andrews, John T.S.; Westrum, Edgar F.,
Heat capacity and thermodynamic properties of [2.2]paracyclophane. Mechanism of the 50.deg.K transition,
J. Phys. Chem., 1970, 74, 10, 2170-2174, https://doi.org/10.1021/j100909a022
. [all data]
Gleiter, Eckert-Maksic, et al., 1982
Gleiter, R.; Eckert-Maksic, M.; Schafer, W.; Truesdale, E.A.,
Quest for a strong through bond interaction in [2.2]paracyclophane,
Chem. Ber., 1982, 115, 2009. [all data]
Kovac, Mohraz, et al., 1980
Kovac, B.; Mohraz, M.; Heilbronner, E.; Boekelheide, V.; Hopf, H.,
Photoelectron spectra of the cyclophanes,
J. Am. Chem. Soc., 1980, 102, 4314. [all data]
Heilbronner and Maier, 1974
Heilbronner, E.; Maier, J.P.,
Consequences of substitution in the photoelectron spectra of [2,2] paracyclophanes: separation of 'through-space' and 'through-bond' interactions as a consequence of fluorosubstitution,
Helv. Chim. Acta, 1974, 57, 151. [all data]
Pignataro, Mancini, et al., 1971
Pignataro, S.; Mancini, V.; Ridyard, J.N.A.; Lempka, H.J.,
Photoelectron energy spectra of molecules having classically non-conjugated π-systems,
Chem. Commun., 1971, 142. [all data]
Zhong-zhi, Kovak, et al., 1981
Zhong-zhi, Y.; Kovak, B.; Heilbronner, E.; Eltamany, S.; Hopf, H.,
192. Ionization energies of methyl-substituted [2.2] paracyclophanes,
Helv. Chim. Acta, 1981, 64, 1991. [all data]
Kovac, Allan, et al., 1980
Kovac, B.; Allan, M.; Heilbronner, E.; Maier, J.P.; Gleiter, R.; Haenel, M.W.; Keehn, P.M.; Reiss, J.A.,
He(Iα) photoelectron spectra of [2.2]cyclophanes,
J. Electron Spectrosc. Relat. Phenom., 1980, 19, 167. [all data]
Koenig, Wielesek, et al., 1975
Koenig, T.; Wielesek, R.; Snell, W.; Balle, T.,
Helium(I) photoelectron spectrum of p-quinodimethane,
J. Am. Chem. Soc., 1975, 97, 3225. [all data]
Boschi and Schmidt, 1973
Boschi, R.; Schmidt, W.,
Transannular π - π interaction in cyclophanes,
Angew. Chem. Int. Ed. Engl., 1973, 12, 402. [all data]
Cram, Dalton, et al., 1963
Cram, D.J.; Dalton, C.K.; Knox, G.R.,
Macro rings. XXIX. Stereochemistry of a 1,6-cycloaddition reaction,
J. Am. Chem. Soc., 1963, 85, 1088-1093. [all data]