Stannane, trimethyl-
- Formula: C3H10Sn
- Molecular weight: 164.821
- CAS Registry Number: 1631-73-8

Phase change data

Data compiled by: José A. Martinho Simões
Quantity | Value | Units | Method | Reference | Comment |
---|---|---|---|---|---|
ΔvapH° | 30.3 | kJ/mol | N/A | Finholt, Bond, et al., 1947 |

Gas phase ion energetics data

Data compiled as indicated in comments:
B - John E. Bartmess
LLK - Sharon G. Lias, Rhoda D. Levin, and Sherif A. Kafafi
Ionization energy determinations
IE (eV) | Method | Reference | Comment |
---|---|---|---|
9.9 | PE | Beltram, Fehlner, et al., 1980 | Vertical value; LLK |
De-protonation reactions
C3H9Sn- + = C3H10Sn
By formula: C3H9Sn- + H+ = C3H10Sn
Quantity | Value | Units | Method | Reference | Comment |
---|---|---|---|---|---|
ΔrH° | 1461. ± 8.8 | kJ/mol | G+TS | Brinkman, Salomon, et al., 1995 | gas phase; Acidity between MeCO2H and PhOH; B |
Quantity | Value | Units | Method | Reference | Comment |
ΔrG° | 1431. ± 8.4 | kJ/mol | IMRB | Brinkman, Salomon, et al., 1995 | gas phase; Acidity between MeCO2H and PhOH; B |

Reaction thermochemistry data

Data compiled as indicated in comments:
MS - José A. Martinho Simões
B - John E. Bartmess
Individual Reactions
By formula: C3H10Sn (g) = H (g) + C3H9Sn (g)
Quantity | Value | Units | Method | Reference | Comment |
---|---|---|---|---|---|
ΔrH° | 74.6 ± 2.5 | kcal/mol | ICR | Brinkman, Salomon, et al., 1995 | The reaction enthalpy was derived from the acidity of Sn(Me)3(H)(g), 349.0 ± 2.0 kcal/mol, the electron affinity of Sn(Me)3(g), 39.2 ± 1.5 kcal/mol Brinkman, Salomon, et al., 1995, and the ionization energy of H(g), 313.58 kcal/mol Lias, Bartmess, et al., 1988.; MS |
C3H9Sn- + = C3H10Sn
By formula: C3H9Sn- + H+ = C3H10Sn
Quantity | Value | Units | Method | Reference | Comment |
---|---|---|---|---|---|
ΔrH° | 349.2 ± 2.1 | kcal/mol | G+TS | Brinkman, Salomon, et al., 1995 | gas phase; Acidity between MeCO2H and PhOH; B |
Quantity | Value | Units | Method | Reference | Comment |
ΔrG° | 341.9 ± 2.0 | kcal/mol | IMRB | Brinkman, Salomon, et al., 1995 | gas phase; Acidity between MeCO2H and PhOH; B |

References

Finholt, Bond, et al., 1947
Finholt, A.E.; Bond, A.C., Jr.; Wilzbach, K.E.; Schlesinger, H.I.,
J. Am. Chem. Soc., 1947, 69, 2692. [all data]
Beltram, Fehlner, et al., 1980
Beltram, G.; Fehlner, T.P.; Mochida, K.; Kochi, J.K.,
UV photoelectron spectra of group IV alkyl hydrides,
J. Electron Spectrosc. Relat. Phenom., 1980, 18, 153. [all data]
Brinkman, Salomon, et al., 1995
Brinkman, E.A.; Salomon, K.; Tumas, W.; Brauman, J.I.,
Electron affinities and gas-phase acidities of organogermanium and organotin compounds,
J. Am. Chem. Soc., 1995, 117, 17, 4905, https://doi.org/10.1021/ja00122a022
. [all data]