Pyridine, 2-methoxy-
- Formula: C6H7NO
- Molecular weight: 109.1259
- IUPAC Standard InChIKey: IWTFOFMTUOBLHG-UHFFFAOYSA-N
- CAS Registry Number: 1628-89-3
- Chemical structure:
View 3d structure (requires JavaScript / HTML 5) - Other names: 2-Methoxypyridine

Phase change data

Data compiled as indicated in comments:
BS - Robert L. Brown and Stephen E. Stein
TRC - Thermodynamics Research Center, NIST Boulder Laboratories, Chris Muzny director
AC - William E. Acree, Jr., James S. Chickos
ALS - Hussein Y. Afeefy, Joel F. Liebman, and Stephen E. Stein
Quantity | Value | Units | Method | Reference | Comment |
---|---|---|---|---|---|
Tboil | 415.7 | K | N/A | Weast and Grasselli, 1989 | BS |
Tboil | 415. | K | N/A | Beak, Bonham, et al., 1968 | Uncertainty assigned by TRC = 3. K; TRC |
Enthalpy of vaporization
ΔvapH (kJ/mol) | Temperature (K) | Method | Reference | Comment |
---|---|---|---|---|
40.5 | 319. | A | Stephenson and Malanowski, 1987 | Based on data from 304. to 338. K.; AC |
41. ± 3.1 | 403. | V | Beak, Bonham, et al., 1968, 2 | Heat of isomerization; ALS |

Reaction thermochemistry data

Data compiled by: Hussein Y. Afeefy, Joel F. Liebman, and Stephen E. Stein
Individual Reactions
By formula: C6H7NO = C6H7NO
Quantity | Value | Units | Method | Reference | Comment |
---|---|---|---|---|---|
ΔrH° | -57.3 ± 4.6 | kJ/mol | Ciso | Beak, Mueller, et al., 1974 | liquid phase; solvent: 1,2-Dichloroethane; #LED |
ΔrH° | -39. ± 5.9 | kJ/mol | Ciso | Beak, Mueller, et al., 1974 | gas phase; Hr gas phase |
ΔrH° | -52. ± 3. | kJ/mol | Eqk | Beak, Bonham, et al., 1968, 2 | liquid phase; Heat of isomerization |
ΔrH° | -33. ± 9.6 | kJ/mol | Eqk | Beak, Bonham, et al., 1968, 2 | gas phase; Gas phase isomerization |
ΔrH° | -52. ± 3. | kJ/mol | Eqk | Beak and Bonham, 1966 | liquid phase; At 403 K |

Gas phase ion energetics data

Data evaluated as indicated in comments:
HL - Edward P. Hunter and Sharon G. Lias
Data compiled as indicated in comments:
LLK - Sharon G. Lias, Rhoda D. Levin, and Sherif A. Kafafi
Quantity | Value | Units | Method | Reference | Comment |
---|---|---|---|---|---|
Proton affinity (review) | 934.7 | kJ/mol | N/A | Hunter and Lias, 1998 | HL |
Quantity | Value | Units | Method | Reference | Comment |
Gas basicity | 902.8 | kJ/mol | N/A | Hunter and Lias, 1998 | HL |
Ionization energy determinations
IE (eV) | Method | Reference | Comment |
---|---|---|---|
8.7 | PE | Cook, El-Abbady, et al., 1977 | LLK |
8.9 ± 0.1 | EI | Stefanovic and Grutzmacher, 1974 | LLK |
8.96 ± 0.02 | EI | Gronneberg and Undheim, 1972 | LLK |
8.82 ± 0.03 | PE | Cook, El-Abbady, et al., 1977 | Vertical value; LLK |

Van Den Dool and Kratz RI, polar column, temperature ramp

Column type | Active phase | I | Reference | Comment |
---|---|---|---|---|
Capillary | OV-351 | 1468. | Bonvehi and Coll, 2003 | 50. m/0.32 mm/0.2 μm, He, 5. K/min; Tstart: 60. C; Tend: 220. C |

References

Weast and Grasselli, 1989
CRC Handbook of Data on Organic Compounds, 2nd Editon, Weast,R.C and Grasselli, J.G., ed(s)., CRC Press, Inc., Boca Raton, FL, 1989, 1. [all data]
Beak, Bonham, et al., 1968
Beak, P.; Bonham, J.; Lee, J.T.,
Equilibrium studies. The energy for some six-membered heterocyclic methyl amide-imidate isomer pairs,
J. Am. Chem. Soc., 1968, 90, 1569-82. [all data]
Stephenson and Malanowski, 1987
Stephenson, Richard M.; Malanowski, Stanislaw,
Handbook of the Thermodynamics of Organic Compounds, 1987, https://doi.org/10.1007/978-94-009-3173-2
. [all data]
Beak, Bonham, et al., 1968, 2
Beak, P.; Bonham, J.; Lee, J.T., Jr.,
Equilibration studies. The energy differences for some six-membered heterocyclic methyl amide-imidate isomer paris,
J. Am. Chem. Soc., 1968, 90, 1569-1582. [all data]
Beak, Mueller, et al., 1974
Beak, P.; Mueller, D.S.; Lee, J.,
Equilibration studies. Determination of the enthalpy difference between methyltropic isomers from heats of methylation,
J. Am. Chem. Soc., 1974, 96, 3867-3874. [all data]
Beak and Bonham, 1966
Beak, P.; Bonham, J.,
Equilibration studies: the relative chemical binding energies of 2-methoxypyridine-n-methylpyrid-2-one and 4-methoxypyridine-N-methylpyrid-4-one,
Chem. Commun., 1966, 631-632. [all data]
Hunter and Lias, 1998
Hunter, E.P.; Lias, S.G.,
Evaluated Gas Phase Basicities and Proton Affinities of Molecules: An Update,
J. Phys. Chem. Ref. Data, 1998, 27, 3, 413-656, https://doi.org/10.1063/1.556018
. [all data]
Cook, El-Abbady, et al., 1977
Cook, M.J.; El-Abbady, S.; Katritzky, A.R.; Guimon, C.; Pfister-Guillouzo, G.,
Photoelectron spectra of hydroxy- and mercapto-pyridines and models of fixed structure,
J. Chem. Soc. Perkin Trans. 2, 1977, 1652. [all data]
Stefanovic and Grutzmacher, 1974
Stefanovic, D.; Grutzmacher, H.F.,
The ionisation potential of some substituted pyridines,
Org. Mass Spectrom., 1974, 9, 1052. [all data]
Gronneberg and Undheim, 1972
Gronneberg, T.; Undheim, K.,
Mass spectrometry of onium compounds. XI: ionization potentials of hydroxy and mercapto pyridines,
Org. Mass Spectrom., 1972, 6, 823. [all data]
Bonvehi and Coll, 2003
Bonvehi, J.S.; Coll, F.V.,
Flavour index and aroma profiles of fresh and processed honeys,
J. Sci. Food Agric., 2003, 83, 4, 275-282, https://doi.org/10.1002/jsfa.1308
. [all data]