1,3,5-Trisilacyclohexane, 1,1,3,3,5,5-hexamethyl-
- Formula: C9H24Si3
- Molecular weight: 216.5434
- IUPAC Standard InChIKey: ICSWLKDKQBNKAY-UHFFFAOYSA-N
- CAS Registry Number: 1627-99-2
- Chemical structure:
View 3d structure (requires JavaScript / HTML 5) - Other names: 1,1,3,3,5,5-Hexamethylcyclotrimethylenetrisilane; 1,1,3,3,5,5-Hexamethyl-1,3,5-trisilacyclohexane

Condensed phase thermochemistry data

Data compiled by: Eugene S. Domalski and Elizabeth D. Hearing
Quantity | Value | Units | Method | Reference | Comment |
---|---|---|---|---|---|
S°solid,1 bar | 477.39 | J/mol*K | N/A | Guseinov, Karasharli, et al., 1975 |
Constant pressure heat capacity of solid
Cp,solid (J/mol*K) | Temperature (K) | Reference | Comment |
---|---|---|---|
400.95 | 298.15 | Guseinov, Karasharli, et al., 1975 | T = 10 to 300 K. Data given graphically. |

Phase change data

Data compiled as indicated in comments:
TRC - Thermodynamics Research Center, NIST Boulder Laboratories, Chris Muzny director
DH - Eugene S. Domalski and Elizabeth D. Hearing
AC - William E. Acree, Jr., James S. Chickos
Quantity | Value | Units | Method | Reference | Comment |
---|---|---|---|---|---|
Ttriple | 269.28 | K | N/A | Guseinov, Karasharli, et al., 1975, 2 | Uncertainty assigned by TRC = 0.02 K; TRC |
Enthalpy of vaporization
ΔvapH (kJ/mol) | Temperature (K) | Reference | Comment |
---|---|---|---|
45.522 | 476.55 | Guseinov, Karasharli, et al., 1975 | DH |
Entropy of vaporization
ΔvapS (J/mol*K) | Temperature (K) | Reference | Comment |
---|---|---|---|
95.52 | 476.55 | Guseinov, Karasharli, et al., 1975 | DH |
Enthalpy of fusion
ΔfusH (kJ/mol) | Temperature (K) | Reference | Comment |
---|---|---|---|
16.498 | 269.28 | Guseinov, Karasharli, et al., 1975 | DH |
16.5 | 269.3 | Domalski and Hearing, 1996 | See also Guseinov, Karasharli, et al., 1975, 2.; AC |
Entropy of fusion
ΔfusS (J/mol*K) | Temperature (K) | Reference | Comment |
---|---|---|---|
61.42 | 269.28 | Guseinov, Karasharli, et al., 1975 | DH |

Gas phase ion energetics data

Data compiled by: Henry M. Rosenstock, Keith Draxl, Bruce W. Steiner, and John T. Herron
Ionization energy determinations
IE (eV) | Method | Reference |
---|---|---|
9.39 ± 0.03 | EI | Pitt, Habercom, et al., 1968 |

References

Guseinov, Karasharli, et al., 1975
Guseinov, Z.A.; Karasharli, K.A.; Dzhafarov, O.I.; Nurullaev, G.G.; Nametkin, N.S.; Gusel'nikov, L.E.; Volnina, F.A.; Burdasov, E.N.; Vdovin, V.M.,
Thermodynamic parameters of some cyclic and bridging carbosilanes,
Dokl.Akad. Nauk, 1975, SSSR 222, 1369-1372. [all data]
Guseinov, Karasharli, et al., 1975, 2
Guseinov, A.Z.; Karasharli, K.A.; Dzhafarov, O.I.; Nurullaev, G.G.; Nametkin, N.S.; Gusel'nikov, L.E.; Volnina, E.A.; Burdasov, E.N.; Vdovin, V.N.,
Dokl. Akad. Nauk SSSR, 1975, 222, 1369. [all data]
Domalski and Hearing, 1996
Domalski, Eugene S.; Hearing, Elizabeth D.,
Heat Capacities and Entropies of Organic Compounds in the Condensed Phase. Volume III,
J. Phys. Chem. Ref. Data, 1996, 25, 1, 1, https://doi.org/10.1063/1.555985
. [all data]
Pitt, Habercom, et al., 1968
Pitt, C.G.; Habercom, M.S.; Bursey, M.M.; Rogerson, P.F.,
The electronic absorption and ionization potentials of carbosilanes. The question of 1,3(d-d) interaction in the excited state,
J. Organometal. Chem., 1968, 15, 359. [all data]