1H-Indole, 4,5,6,7-tetrafluoro-
- Formula: C8H3F4N
- Molecular weight: 189.1097
- IUPAC Standard InChIKey: DTNBMVQXEVNTLO-UHFFFAOYSA-N
- CAS Registry Number: 16264-67-8
- Chemical structure:
View 3d structure (requires JavaScript / HTML 5) - Permanent link for this species. Use this link for bookmarking this species for future reference.

Gas phase ion energetics data

Data compiled by: Sharon G. Lias, Rhoda D. Levin, and Sherif A. Kafafi
Ionization energy determinations
IE (eV) | Method | Reference | Comment |
---|---|---|---|
8.30 ± 0.015 | PE | Gusten, Klasinc, et al., 1976 | Vertical value |

References

Gusten, Klasinc, et al., 1976
Gusten, H.; Klasinc, L.; Ruscic, B.,
Photoelectron spectroscopy of J. Heterocycl. Chem.. Indene analogs,
Z. Naturforsch. A:, 1976, 31, 1051. [all data]