Trimethylphenylgermanium
- Formula: C9H14Ge
- Molecular weight: 194.85
- IUPAC Standard InChIKey: NSXUUYLQZUABBS-UHFFFAOYSA-N
- CAS Registry Number: 1626-00-2
- Chemical structure:
View 3d structure (requires JavaScript / HTML 5) - Other names: Germane, trimethylphenyl-; Phenyltrimethylgermane; Trimethylgermylbenzene; Trimethylphenylgermane

Gas phase ion energetics data

Data compiled by: Sharon G. Lias, Rhoda D. Levin, and Sherif A. Kafafi
Ionization energy determinations
IE (eV) | Method | Reference | Comment |
---|---|---|---|
8.98 ± 0.05 | PE | Distefano, Pignataro, et al., 1974 | |
~8.75 | CTS | Pitt, 1973 | |
9.00 | PE | Bischof, Dewar, et al., 1974 | Vertical value |

References

Distefano, Pignataro, et al., 1974
Distefano, G.; Pignataro, S.; Ricci, A.; Colonna, F.P.; Pietropaolo, D.,
Interactions of π-orbitals with the group IV elements studied by ionization energy measurements,
Ann. Chim., 1974, 64, 153. [all data]
Pitt, 1973
Pitt, C.G.,
Hyperconjugation and its role in group IV chemistry,
J. Organomet. Chem., 1973, 61, 49. [all data]
Bischof, Dewar, et al., 1974
Bischof, P.K.; Dewar, M.J.S.; Goodman, D.W.; Jones, T.B.,
Photoelectron spectra of molecules. VI. Hyperconjugation versus pπ-dπ bonding in group IVb compounds,
J. Organomet. Chem., 1974, 82, 89. [all data]