1H-Benz[f]indene, 2,3-dihydro-
- Formula: C13H12
- Molecular weight: 168.2344
- IUPAC Standard InChIKey: VEWAWZXAARZEAN-UHFFFAOYSA-N
- CAS Registry Number: 1624-26-6
- Chemical structure:
View 3d structure (requires JavaScript / HTML 5) - Permanent link for this species. Use this link for bookmarking this species for future reference.

Gas phase ion energetics data

Data compiled by: Sharon G. Lias, Rhoda D. Levin, and Sherif A. Kafafi
Ionization energy determinations
IE (eV) | Method | Reference | Comment |
---|---|---|---|
7.85 ± 0.03 | PE | Heilbronner, Hoshi, et al., 1976 | Vertical value |

References

Heilbronner, Hoshi, et al., 1976
Heilbronner, E.; Hoshi, T.; von Rosenberg, J.L.; Hafner, K.,
Alkyl-induced, natural hypsochromic shifts of the 2A←2X and 2B←2X transitions of azulene and naphthalene radical cations,
Nouv. J. Chim., 1976, 1, 105. [all data]