3-Quinuclidinol
- Formula: C7H13NO
- Molecular weight: 127.1842
- IUPAC Standard InChIKey: IVLICPVPXWEGCA-UHFFFAOYSA-N
- CAS Registry Number: 1619-34-7
- Chemical structure:
View 3d structure (requires JavaScript / HTML 5) - Other names: 1-Azabicyclo[2.2.2]octan-3-ol; Quinuclidinol; 3-Hydroxyquinuclidine; Quinuclidinol-3; 3-Hydroxy-1-azabicyclo[2.2.2]octane; Quinuclidine-3-ol; Quinuclidin-3-ol; NSC 93905

Gas phase ion energetics data

Data compiled by: Sharon G. Lias, Rhoda D. Levin, and Sherif A. Kafafi
Ionization energy determinations
IE (eV) | Method | Reference |
---|---|---|
≤8.1 | PE | Aue and Bowers, 1979 |

Kovats' RI, non-polar column, isothermal

Column type | Active phase | Temperature (C) | I | Reference | Comment |
---|---|---|---|---|---|
Capillary | Methyl Silicone | 120. | 1152. | Huber, Kenndler, et al., 1993 | H2; Column length: 5. m; Phase thickness: 2.65 μm |
Capillary | Methyl Silicone | 140. | 1162. | Huber, Kenndler, et al., 1993 | H2; Column length: 5. m; Phase thickness: 2.65 μm |

Kovats' RI, polar column, isothermal

Column type | Active phase | Temperature (C) | I | Reference | Comment |
---|---|---|---|---|---|
Capillary | PEG-20M | 190. | 1985. | Huber, Kenndler, et al., 1993 | Column length: 10. m; Phase thickness: 1.33 μm |
Capillary | PEG-20M | 210. | 2001. | Huber, Kenndler, et al., 1993 | Column length: 10. m; Phase thickness: 1.33 μm |
Capillary | PEG-20M | 130. | 1936.2 | Huber, Kenndler, et al., 1993 | Column length: 10. m; Phase thickness: 1.33 μm |

References

Aue and Bowers, 1979
Aue, D.H.; Bowers, M.T.,
Chapter 9. Stabilities of positive ions from equilibrium gas phase basicity measurements
in Ions Chemistry,, ed. M.T. Bowers, 1979. [all data]