2,4-Dithiapentane
- Formula: C3H8S2
- Molecular weight: 108.226
- IUPAC Standard InChIKey: LOCDPORVFVOGCR-UHFFFAOYSA-N
- CAS Registry Number: 1618-26-4
- Chemical structure:
View 3d structure (requires JavaScript / HTML 5) - Other names: CH3SCH2SCH3; Bis(methylthio)methane; Formaldehyde dimethyl mercaptal; Methane, bis(methylthio)-; Bis(methylmercapto)methane; Methylenebis(methyl sulfide); Thioformaldehyde dimethylthioacetal; Bis(methylsulfanyl)methane; 2,4-Dithiopentane; NSC 96010; Thioformaldehyde dimethyl acetal; bis(methylthio)methan

Phase change data

Data compiled by: Robert L. Brown and Stephen E. Stein
Quantity | Value | Units | Method | Reference | Comment |
---|---|---|---|---|---|
Tboil | 421.2 | K | N/A | Weast and Grasselli, 1989 | |
Tboil | 415. to 416. | K | N/A | Buckingham and Donaghy, 1982 |
Reduced pressure boiling point
Tboil (K) | Pressure (atm) | Reference |
---|---|---|
314. | 0.0151 | Buckingham and Donaghy, 1982 |

Gas phase ion energetics data

Data compiled as indicated in comments:
LLK - Sharon G. Lias, Rhoda D. Levin, and Sherif A. Kafafi
Ionization energy determinations
IE (eV) | Method | Reference | Comment |
---|---|---|---|
8.67 | PE | Guimon, Guimon, et al., 1975 | Vertical value; LLK |
8.65 | PE | Bock, Wagner, et al., 1972 | Vertical value; LLK |
Appearance energy determinations
Ion | AE (eV) | Other Products | Method | Reference | Comment |
---|---|---|---|---|---|
C2H5S+ | 10.1 ± 0.15 | SCH3 | EI | Broer, Weringa, et al., 1979 | LLK |

Kovats' RI, non-polar column, isothermal

View large format table.

Column type Active phase Temperature (C) I Reference Comment
PackedApiezon M130.903.Garbuzov, Misharina, et al., 1985He or N2, Chromosorb W, AW-DMCS; Column length: 2.1 m

Van Den Dool and Kratz RI, non-polar column, temperature ramp

View large format table.

Column type Active phase I Reference Comment
CapillaryDB-5892.Mahattanatawee K., Perez-Cacho P.R., et al., 200730. m/0.32 mm/0.5 μm, He, 7. K/min, 265. C @ 5. min; Tstart: 40. C
CapillaryCP Sil 8 CB880.Mahadevan and Farmer, 200660. C @ 5. min, 4. K/min, 220. C @ 30. min; Column length: 50. m; Column diameter: 0.32 mm

Van Den Dool and Kratz RI, non-polar column, custom temperature program

View large format table.

Column type Active phase I Reference Comment
CapillarySE-54885.Kubícková and Grosch, 1997Column length: 30. m; Column diameter: 0.32 mm; Program: 35C (2min) => 40C/min => 50C (2min) => 4C/min => 250C (10min)
CapillarySE-54889.Kubícková and Grosch, 1997Column length: 30. m; Column diameter: 0.32 mm; Program: 35C (2min) => 40C/min => 50C (2min) => 4C/min => 250C (10min)

Van Den Dool and Kratz RI, polar column, temperature ramp

View large format table.

Column type Active phase I Reference Comment
CapillaryDB-Wax1290.Mahattanatawee K., Perez-Cacho P.R., et al., 200730. m/0.32 mm/0.5 μm, He, 7. K/min, 240. C @ 5. min; Tstart: 40. C
CapillaryCP-Wax 52CB1272.Mahadevan and Farmer, 200660. C @ 5. min, 4. K/min, 220. C @ 30. min; Column length: 50. m; Column diameter: 0.32 mm
CapillaryCP-Wax 52CB1285.Mahadevan and Farmer, 200660. C @ 5. min, 4. K/min, 220. C @ 30. min; Column length: 50. m; Column diameter: 0.32 mm
CapillaryDB-Wax1282.Shimoda, Peralta, et al., 199660. m/0.25 mm/0.25 μm, He, 3. K/min; Tstart: 50. C; Tend: 230. C

Normal alkane RI, non-polar column, temperature ramp

View large format table.

Column type Active phase I Reference Comment
CapillarySPB-1871.Frerot, Velluz, et al., 200830. m/0.25 mm/1.0 μm, Helium, 60. C @ 5. min, 5. K/min; Tend: 250. C
CapillarySPB-5894.Vasta, Ratel, et al., 200760. m/0.32 mm/1. μm, 40. C @ 5. min, 3. K/min, 230. C @ 5. min
CapillaryHP-1862.Bendimerad and Bendiab, 200550. m/0.2 mm/0.5 μm, He, 2. K/min, 250. C @ 60. min; Tstart: 60. C
CapillaryDB-5881.Schlüter, Steinhart, et al., 199934. C @ 3. min, 5. K/min, 200. C @ 10. min; Phase thickness: 0.25 μm
CapillaryHP-5889.Kubec, Drhová, et al., 199830. m/0.25 mm/0.25 μm, N2, 40. C @ 3. min, 4. K/min, 240. C @ 10. min
CapillaryDB-1873.Rapior, Breheret, et al., 199730. m/0.2 mm/0.25 μm, He, 50. C @ 2. min, 4. K/min; Tend: 200. C
CapillarySE-54904.Bellesia, Pinetti, et al., 199625. m/0.2 mm/0.5 μm, He, 35. C @ 2. min, 5. K/min; Tend: 250. C

Normal alkane RI, non-polar column, custom temperature program

View large format table.

Column type Active phase I Reference Comment
CapillarySPB-5892.Begnaud, Pérès, et al., 200360. m/0.32 mm/1. μm; Program: not specified
CapillaryPolydimethyl siloxane894.Spanier, Shahidi, et al., 2001Program: not specified

Normal alkane RI, polar column, temperature ramp

View large format table.

Column type Active phase I Reference Comment
CapillaryInnowax1300.Bendimerad and Bendiab, 200550. m/0.2 mm/0.5 μm, He, 2. K/min, 250. C @ 60. min; Tstart: 60. C
CapillaryDB-Wax1260.Schlüter, Steinhart, et al., 199960. m/0.32 mm/0.25 μm, He, 34. C @ 3. min, 5. K/min, 200. C @ 10. min
CapillaryHP-Innowax1289.Kubec, Drhová, et al., 199830. m/0.25 mm/0.25 μm, N2, 40. C @ 3. min, 4. K/min, 190. C @ 10. min

Normal alkane RI, polar column, custom temperature program

View large format table.

Column type Active phase I Reference Comment
CapillaryEC-10001305.Delabre and Bendall, 9999Program: not specified
CapillaryCP Wax 52 CB1274.Patterson and Stevenson, 199550. m/0.32 mm/0.20 μm; Program: 50 0C (10 min) 2 0C/min -> 100 0C 5 0C/min -> 150 0C 7 0C/min -> 220 0C (20 min)
CapillarySuperox 0.6; Carbowax 20M1256.Waggott and Davies, 1984Hydrogen; Column length: 50. m; Column diameter: 0.32 mm; Program: not specified
CapillaryCarbowax 400, Carbowax 20M, Carbowax 1540, Carbowax 4000, Superox 06, PEG 20M, etc.1256.Waggott and Davies, 1984Hydrogen; Column length: 50. m; Column diameter: 0.32 mm; Program: not specified

References

Weast and Grasselli, 1989
CRC Handbook of Data on Organic Compounds, 2nd Editon, Weast,R.C and Grasselli, J.G., ed(s)., CRC Press, Inc., Boca Raton, FL, 1989, 1. [all data]
Buckingham and Donaghy, 1982
Buckingham, J.; Donaghy, S.M.,
Dictionary of Organic Compounds: Fifth Edition, Chapman and Hall, New York, 1982, 1. [all data]
Guimon, Guimon, et al., 1975
Guimon, C.; Guimon, M.-F.; Pfister-Guillouzo, G.,
Application of photoelectron spectroscopy to conformational analysis of two 1,3-dithia compounds,
Tetrahedron Lett., 1975, 17, 1413. [all data]
Bock, Wagner, et al., 1972
Bock, H.; Wagner, G.; Kroner, J.,
Photoelektronenspektren und molekuleigenschaften, XIV. Die delokalisation des schwefel-elektronenpaar in CH3S-substituierten aromaten,
Chem. Ber., 1972, 105, 3850. [all data]
Broer, Weringa, et al., 1979
Broer, W.J.; Weringa, W.D.; Nieuwpoort, W.C.,
Rearrangements and fragmentations of [C2H5S]+ ions,
Org. Mass Spectrom., 1979, 14, 543. [all data]