cis-1,2-Divinylcyclobutane
- Formula: C8H12
- Molecular weight: 108.1809
- IUPAC Standard InChIKey: UHHCYAAVGADGGP-OCAPTIKFSA-N
- CAS Registry Number: 16177-46-1
- Chemical structure:
View 3d structure (requires JavaScript / HTML 5) - Stereoisomers:
- Other names: cis-1,2-Diethenyl-cyclobutane; Cyclobutane, cis-1,2-diethenyl-; Cyclobutane, 1,2-diethenyl-, cis-; Cyclobutane, (Z)-1,2-diethenyl; (Z)-1,2-Divinylcyclobutane

Gas phase thermochemistry data

Data compiled by: Hussein Y. Afeefy, Joel F. Liebman, and Stephen E. Stein
Quantity | Value | Units | Method | Reference | Comment |
---|---|---|---|---|---|
ΔfH°gas | 188.0 ± 5.5 | kJ/mol | Kin | Leitich, 1979 |

Condensed phase thermochemistry data

Data compiled by: Hussein Y. Afeefy, Joel F. Liebman, and Stephen E. Stein
Quantity | Value | Units | Method | Reference | Comment |
---|---|---|---|---|---|
ΔcH°liquid | -4987.3 | kJ/mol | Ccr | Rauh, Geyer, et al., 1973 | Corresponding ΔfHºliquid = 124. kJ/mol (simple calculation by NIST; no Washburn corrections) |

Phase change data

Data compiled as indicated in comments:
BS - Robert L. Brown and Stephen E. Stein
ALS - Hussein Y. Afeefy, Joel F. Liebman, and Stephen E. Stein
Quantity | Value | Units | Method | Reference | Comment |
---|---|---|---|---|---|
ΔvapH° | 42.26 | kJ/mol | V | Rauh, Geyer, et al., 1973 | ALS |
Reduced pressure boiling point
Tboil (K) | Pressure (bar) | Reference | Comment |
---|---|---|---|
311.2 | 0.051 | Weast and Grasselli, 1989 | BS |

Gas phase ion energetics data

Data compiled as indicated in comments:
LLK - Sharon G. Lias, Rhoda D. Levin, and Sherif A. Kafafi
Ionization energy determinations
IE (eV) | Method | Reference | Comment |
---|---|---|---|
9.22 | PE | Bischof, Gleiter, et al., 1981 | Vertical value; LLK |

References

Leitich, 1979
Leitich, J.,
Kinetics of the thermal dimerization and isomerization of cis,trans-1,5-cyclooctadiene in the gas phase and of related reactions. A simple algorithm to determine the rate constants of competing first- and second-order reactions,
Int. J. Chem. Kinet., 1979, 11, 1249-1261. [all data]
Rauh, Geyer, et al., 1973
Rauh, H.J.; Geyer, W.; Schmidt, H.; Geiseler, G.,
Bildungsenthalpien und mesomerieenergien von π-bindungssystemen,
Z. Phys. Chem. (Leipzig), 1973, 253, 43-48. [all data]
Weast and Grasselli, 1989
CRC Handbook of Data on Organic Compounds, 2nd Editon, Weast,R.C and Grasselli, J.G., ed(s)., CRC Press, Inc., Boca Raton, FL, 1989, 1. [all data]
Bischof, Gleiter, et al., 1981
Bischof, P.; Gleiter, R.; Gubernator, K.; Haider, R.; Musso, H.; Schwarz, W.; Trautmann, W.; Hopf, H.,
Photoelectronen-spektroskopische untersuchungen an divinylcyclobutanen,
Chem. Ber., 1981, 114, 994. [all data]