(E)-pent-3-en-1-oic acid
- Formula: C5H8O2
- Molecular weight: 100.1158
- IUPAC Standard InChIKey: UIUWNILCHFBLEQ-NSCUHMNNSA-N
- CAS Registry Number: 1617-32-9
- Chemical structure:
View 3d structure (requires JavaScript / HTML 5) - Stereoisomers:
- Other names: 3-Pentenoic acid, (E)-

Condensed phase thermochemistry data

Data compiled by: Hussein Y. Afeefy, Joel F. Liebman, and Stephen E. Stein
Quantity | Value | Units | Method | Reference | Comment |
---|---|---|---|---|---|
ΔcH°liquid | -4029. | kJ/mol | Cm | Schjanberg, 1938 | Corresponding ΔfHºliquid = 918.0 kJ/mol (simple calculation by NIST; no Washburn corrections) |

Phase change data

Data compiled by: Thermodynamics Research Center, NIST Boulder Laboratories, Chris Muzny director
Quantity | Value | Units | Method | Reference | Comment |
---|---|---|---|---|---|
Tc | 666.9 | K | N/A | D'Souza and Teja, 1987 | Uncertainty assigned by TRC = 3. K; Ambrose's procedure |
Quantity | Value | Units | Method | Reference | Comment |
Pc | 41.8704 | bar | N/A | D'Souza and Teja, 1987 | Uncertainty assigned by TRC = 1.00 bar; Ambrose's procedure |

Gas phase ion energetics data

Data compiled as indicated in comments:
LLK - Sharon G. Lias, Rhoda D. Levin, and Sherif A. Kafafi
Ionization energy determinations
IE (eV) | Method | Reference | Comment |
---|---|---|---|
9.41 | PE | Holmes, Terlouw, et al., 1979 | LLK |

References

Schjanberg, 1938
Schjanberg, E.,
Cis-pentensyreetylestrarnas forbranningsvarmen, refraktionsdata och alkaliska hydrolys,
Svensk. Kim. Tidr., 1938, 50, 102-106. [all data]
D'Souza and Teja, 1987
D'Souza, R.; Teja, A.S.,
The prediction of the vapor pressures of carboxylic acids,
Chem. Eng. Commun., 1987, 61, 13. [all data]
Holmes, Terlouw, et al., 1979
Holmes, J.L.; Terlouw, J.K.; Vijfhuizen, P.C.; A'Campo, C.,
Metastable ion studies XII-Molecular and fragment ion structures for isomeric C4H6O2 acids,
Org. Mass Spectrom., 1979, 14, 204. [all data]