Hydrazine, 1,2-diethyl-
- Formula: C4H12N2
- Molecular weight: 88.1515
- IUPAC Standard InChIKey: YCBOYOYVDOUXLH-UHFFFAOYSA-N
- CAS Registry Number: 1615-80-1
- Chemical structure:
View 3d structure (requires JavaScript / HTML 5) - Other names: N,N'-Diethylhydrazine; 1,2-Diethylhydrazine; 1,2-Diaethylhydrazin; sym-Diethylhydrazine; Hydrazoethane; Hydroazoethane; Rcra waste number U086; SDEH

Phase change data

Data compiled by: Robert L. Brown and Stephen E. Stein
Quantity | Value | Units | Method | Reference | Comment |
---|---|---|---|---|---|
Tboil | 358.7 | K | N/A | Weast and Grasselli, 1989 |

Gas phase ion energetics data

Data compiled by: Sharon G. Lias, Rhoda D. Levin, and Sherif A. Kafafi
Ionization energy determinations
IE (eV) | Method | Reference | Comment |
---|---|---|---|
8.81 | PE | Rademacher, 1975 | Vertical value |
8.88 | PE | Rademacher, 1973 | Vertical value |

Normal alkane RI, non-polar column, temperature ramp

Column type | Active phase | I | Reference | Comment |
---|---|---|---|---|
Capillary | OV-101 | 710. | Zenkevich, 2005 | 25. m/0.20 mm/0.10 μm, N2/He, 6. K/min; Tstart: 50. C; Tend: 250. C |

References

Weast and Grasselli, 1989
CRC Handbook of Data on Organic Compounds, 2nd Editon, Weast,R.C and Grasselli, J.G., ed(s)., CRC Press, Inc., Boca Raton, FL, 1989, 1. [all data]
Rademacher, 1975
Rademacher, P.,
Acyclische Hydrazine,
Chem. Ber., 1975, 108, 1548. [all data]
Rademacher, 1973
Rademacher, P.,
Photoelectron spectra and conformation of hydrazine derivatives,
Angew. Chem. Int. Ed. Engl., 1973, 12, 408. [all data]
Zenkevich, 2005
Zenkevich, I.G.,
Experimentally measured retention indices., 2005. [all data]