Quinoline, 1-oxide
- Formula: C9H7NO
- Molecular weight: 145.1580
- IUPAC Standard InChIKey: GIIWGCBLYNDKBO-UHFFFAOYSA-N
- CAS Registry Number: 1613-37-2
- Chemical structure:
View 3d structure (requires JavaScript / HTML 5) - Other names: Quinoline oxide; Quinoline N-oxide

Gas phase ion energetics data

Data evaluated as indicated in comments:
HL - Edward P. Hunter and Sharon G. Lias
Data compiled as indicated in comments:
LLK - Sharon G. Lias, Rhoda D. Levin, and Sherif A. Kafafi
Quantity | Value | Units | Method | Reference | Comment |
---|---|---|---|---|---|
Proton affinity (review) | 943.3 | kJ/mol | N/A | Hunter and Lias, 1998 | HL |
Quantity | Value | Units | Method | Reference | Comment |
Gas basicity | 910.8 | kJ/mol | N/A | Hunter and Lias, 1998 | HL |
Ionization energy determinations
IE (eV) | Method | Reference | Comment |
---|---|---|---|
8.00 ± 0.05 | PE | Maier, Muller, et al., 1975 | Vertical value; LLK |

References

Hunter and Lias, 1998
Hunter, E.P.; Lias, S.G.,
Evaluated Gas Phase Basicities and Proton Affinities of Molecules: An Update,
J. Phys. Chem. Ref. Data, 1998, 27, 3, 413-656, https://doi.org/10.1063/1.556018
. [all data]
Maier, Muller, et al., 1975
Maier, J.P.; Muller, J.-F.; Kubota, T.; Yamakawa, M.,
183. Ionisation energies and the electronic structures of the N-oxides of azanaphthalenes and azaanthracenes,
Helv. Chim. Acta, 1975, 58, 1641. [all data]