1-Phenyl-3-methyl-1-butyne
- Formula: C11H12
- Molecular weight: 144.2130
- IUPAC Standard InChIKey: ZSSKQAZGJBLRRM-UHFFFAOYSA-N
- CAS Registry Number: 1612-03-9
- Chemical structure:
View 3d structure (requires JavaScript / HTML 5) - Permanent link for this species. Use this link for bookmarking this species for future reference.

Gas phase ion energetics data

Data compiled as indicated in comments:
LLK - Sharon G. Lias, Rhoda D. Levin, and Sherif A. Kafafi
Ionization energy determinations
IE (eV) | Method | Reference | Comment |
---|---|---|---|
8.35 ± 0.08 | PE | Elbel, Lienert, et al., 1981 | LLK |

References

Elbel, Lienert, et al., 1981
Elbel, S.; Lienert, K.; Krebs, A.; tom Dieck, H.,
Phenylethin - mustersonde fur substituenteneffekte,
Liebigs Ann. Chem., 1981, 1785. [all data]