2-Oxazolidinone,4-methyl-
- Formula: C4H7NO2
- Molecular weight: 101.1039
- IUPAC Standard InChIKey: VAJFEOKPKHIPEN-UHFFFAOYSA-N
- CAS Registry Number: 16112-59-7
- Chemical structure:
View 3d structure (requires JavaScript / HTML 5) - Permanent link for this species. Use this link for bookmarking this species for future reference.

Gas phase ion energetics data

Data compiled by: Sharon G. Lias, Rhoda D. Levin, and Sherif A. Kafafi
Ionization energy determinations
IE (eV) | Method | Reference | Comment |
---|---|---|---|
9.95 | PE | Gerson, Worley, et al., 1978 | Vertical value |

References

Gerson, Worley, et al., 1978
Gerson, S.H.; Worley, S.D.; Bodor, N.; Kaminski, J.J.; Flechtner, T.W.,
The photoelectron spectra of some heterocyclic compounds which contain N, O, Cl, and Br,
J. Electron Spectrosc. Relat. Phenom., 1978, 13, 421. [all data]