1H-Indole, 4-methyl-
- Formula: C9H9N
- Molecular weight: 131.1745
- IUPAC Standard InChIKey: PZOUSPYUWWUPPK-UHFFFAOYSA-N
- CAS Registry Number: 16096-32-5
- Chemical structure:
View 3d structure (requires JavaScript / HTML 5) - Other names: Indole, 4-methyl-; 4-Methylindole; 4-Methyl-1H-indole

Phase change data

Data compiled by: Robert L. Brown and Stephen E. Stein
Quantity | Value | Units | Method | Reference | Comment |
---|---|---|---|---|---|
Tboil | 540.2 | K | N/A | Weast and Grasselli, 1989 |

Gas phase ion energetics data

Data compiled as indicated in comments:
LLK - Sharon G. Lias, Rhoda D. Levin, and Sherif A. Kafafi
Ionization energy determinations
IE (eV) | Method | Reference | Comment |
---|---|---|---|
7.60 ± 0.015 | PE | Gusten, Klasinc, et al., 1976 | LLK |

Lee's RI, non-polar column, temperature ramp

Column type | Active phase | I | Reference | Comment |
---|---|---|---|---|
Capillary | DB-5 | 237.64 | Rostad and Pereira, 1986 | 30. m/0.26 mm/0.25 μm, He, 50. C @ 4. min, 6. K/min, 300. C @ 20. min |

References

Weast and Grasselli, 1989
CRC Handbook of Data on Organic Compounds, 2nd Editon, Weast,R.C and Grasselli, J.G., ed(s)., CRC Press, Inc., Boca Raton, FL, 1989, 1. [all data]
Gusten, Klasinc, et al., 1976
Gusten, H.; Klasinc, L.; Ruscic, B.,
Photoelectron spectroscopy of J. Heterocycl. Chem.. Indene analogs,
Z. Naturforsch. A:, 1976, 31, 1051. [all data]
Rostad and Pereira, 1986
Rostad, C.E.; Pereira, W.E.,
Kovats and Lee retention indices determined by gas chromatography/mass spectrometry for organic compounds of environmental interest,
J. Hi. Res. Chromatogr. Chromatogr. Comm., 1986, 9, 6, 328-334, https://doi.org/10.1002/jhrc.1240090603
. [all data]