4-Ethylthio-3-buten-1-yne
- Formula: C6H8S
- Molecular weight: 112.193
- IUPAC Standard InChIKey: JQPJGIDORMRFQK-UHFFFAOYSA-N
- CAS Registry Number: 1609-42-3
- Chemical structure:
View 3d structure (requires JavaScript / HTML 5) - Permanent link for this species. Use this link for bookmarking this species for future reference.

Gas phase ion energetics data

Data compiled by: Henry M. Rosenstock, Keith Draxl, Bruce W. Steiner, and John T. Herron
Appearance energy determinations
Ion | AE (eV) | Other Products | Method | Reference | Comment |
---|---|---|---|---|---|
CHS+ | 13.8 ± 0.3 | ? | EI | Bogolyubov, Plotnikov, et al., 1969 | |
C2H2S+ | 12.1 ± 0.3 | ? | EI | Bogolyubov, Plotnikov, et al., 1969 | |
C2H3S+ | 13.8 ± 0.3 | ? | EI | Bogolyubov, Plotnikov, et al., 1969 | |
C2H5+ | 13.9 ± 0.3 | ? | EI | Bogolyubov, Plotnikov, et al., 1969 | |
C3HS+ | 13.5 ± 0.3 | ? | EI | Bogolyubov, Plotnikov, et al., 1969 | |
C3H3+ | 14.8 ± 0.3 | ? | EI | Bogolyubov, Plotnikov, et al., 1969 | |
C4H2+ | 16.4 ± 0.3 | ? | EI | Bogolyubov, Plotnikov, et al., 1969 | |
C4H2S+ | 17.6 ± 0.3 | ? | EI | Bogolyubov, Plotnikov, et al., 1969 | |
C4H3+ | 16.4 ± 0.3 | ? | EI | Bogolyubov, Plotnikov, et al., 1969 | |
C4H3S+ | 13.4 ± 0.3 | ? | EI | Bogolyubov, Plotnikov, et al., 1969 | |
C4H4S+ | 10.8 ± 0.3 | ? | EI | Bogolyubov, Plotnikov, et al., 1969 | |
C4H5+ | 13.1 ± 0.3 | ? | EI | Bogolyubov, Plotnikov, et al., 1969 | |
C5H5S+ | 10.0 ± 0.3 | CH3 | EI | Bogolyubov, Plotnikov, et al., 1969 | |
C6H5+ | 12.6 ± 0.3 | ? | EI | Bogolyubov, Plotnikov, et al., 1969 | |
C6H7S+ | 10.3 ± 0.3 | H | EI | Bogolyubov, Plotnikov, et al., 1969 |

References

Bogolyubov, Plotnikov, et al., 1969
Bogolyubov, G.M.; Plotnikov, V.F.; Boiko, Yu.A.; Petrov, A.A.,
Organic derivatives of elements of groups V and VI. IX. Mass spectra of vinylacetylene sulfides,
Zh. Obshch. Khim., 1969, 39, 2467, In original 2407. [all data]