Holmium difluoride

Gas phase ion energetics data

Data compiled by: Henry M. Rosenstock, Keith Draxl, Bruce W. Steiner, and John T. Herron

Ionization energy determinations

IE (eV) Method Reference
6.9 ± 0.3EIZmbov and Margrave, 1966

References

Zmbov and Margrave, 1966
Zmbov, K.F.; Margrave, J.L., Mass spectrometric studies at high temperatures. XII.Stabilities of dysprosium, holmium, and erbium subfluorides, J. Phys. Chem., 1966, 70, 3379. [all data]