Hexametapil
- Formula: C6H18N3P
- Molecular weight: 163.2010
- IUPAC Standard InChIKey: XVDBWWRIXBMVJV-UHFFFAOYSA-N
- CAS Registry Number: 1608-26-0
- Chemical structure:
View 3d structure (requires JavaScript / HTML 5) - Other names: Phosphorous triamide, hexamethyl-; Hexamethylphosphorous triamide; HMPT; Phosphine, tris(dimethylamino)-; Tris(dimethylamino)phosphine; ((CH3)2N)3P; Hexamethylphosphorus triamide; Hexamethyltriaminophosphine; Hexamethyltriamidophosphite; NSC 102707; Phosphorous triamide, N,N,N',N',N'',N''-hexamethyl-

Phase change data

Data compiled by: William E. Acree, Jr., James S. Chickos
Quantity | Value | Units | Method | Reference | Comment |
---|---|---|---|---|---|
ΔvapH° | 41.5 ± 0.6 | kJ/mol | STG | Al-Maydama, Finch, et al., 1995 |
Enthalpy of vaporization
ΔvapH (kJ/mol) | Temperature (K) | Reference | Comment |
---|---|---|---|
63.2 | 313. | Michou-Saucet, Jose, et al., 1984 | Based on data from 298. to 333. K. |

Gas phase ion energetics data

Data evaluated as indicated in comments:
HL - Edward P. Hunter and Sharon G. Lias
Data compiled as indicated in comments:
LBLHLM - Sharon G. Lias, John E. Bartmess, Joel F. Liebman, John L. Holmes, Rhoda D. Levin, and W. Gary Mallard
LLK - Sharon G. Lias, Rhoda D. Levin, and Sherif A. Kafafi
Quantity | Value | Units | Method | Reference | Comment |
---|---|---|---|---|---|
Proton affinity (review) | 930.1 | kJ/mol | N/A | Hunter and Lias, 1998 | HL |
Quantity | Value | Units | Method | Reference | Comment |
Gas basicity | 897.7 | kJ/mol | N/A | Hunter and Lias, 1998 | HL |
Ionization energy determinations
IE (eV) | Method | Reference | Comment |
---|---|---|---|
6.75 | PE | Worley, Hargis, et al., 1982 | LBLHLM |
10.01 | PE | Yarbrough and Hall, 1978 | LLK |
6.7 | PE | Cowley, Goodman, et al., 1977 | LLK |
7.59 | PE | Worley, Hargis, et al., 1982 | Vertical value; LBLHLM |
7.89 ± 0.10 | PE | Cowley, Lattman, et al., 1982 | Vertical value; LBLHLM |
7.61 | PE | Cowley, Goodman, et al., 1977 | Vertical value; LLK |
7.30 | PE | Lappert, Pedley, et al., 1975 | Vertical value; LLK |
7.61 | PE | Cowley, Dewar, et al., 1973 | Vertical value; LLK |

References

Al-Maydama, Finch, et al., 1995
Al-Maydama, H.M.A.; Finch, Arthur; Gardner, P.J.; Head, A.J.,
The enthalpies of formation of (dimethylamino)dichlorophosphine, bis(dimethylamino)chlorophosphine, and tris(dimethylamino)phosphine,
The Journal of Chemical Thermodynamics, 1995, 27, 3, 273-279, https://doi.org/10.1006/jcht.1995.0026
. [all data]
Michou-Saucet, Jose, et al., 1984
Michou-Saucet, Marie-Annie; Jose, Jacques; Michou-Saucet, Christian; Merlin, J.C.,
Pressions de vapeur et enthalpies libres d'exces de systemes binaires: Hexamethylphosphorotriamide (HMPT) + n-hexane; n-heptane; n-octane: A 298,15 K; 303,15 K; 313,15 K; 323,15 K; 333,15 K,
Thermochimica Acta, 1984, 75, 1-2, 85-106, https://doi.org/10.1016/0040-6031(84)85009-1
. [all data]
Hunter and Lias, 1998
Hunter, E.P.; Lias, S.G.,
Evaluated Gas Phase Basicities and Proton Affinities of Molecules: An Update,
J. Phys. Chem. Ref. Data, 1998, 27, 3, 413-656, https://doi.org/10.1063/1.556018
. [all data]
Worley, Hargis, et al., 1982
Worley, S.D.; Hargis, J.H.; Chang, L.; Mattson, G.A.; Jennings, W.B.,
The UPS of some compounds containing the heteroatoms phosphorus, nitrogen and oxygen,
J. Electron Spectrosc. Relat. Phenom., 1982, 25, 135. [all data]
Yarbrough and Hall, 1978
Yarbrough, L.W., II; Hall, M.B.,
Photoelectron spectra of substituted chromium, molybdenum, and tungsten pentacarbonyls. Relative π-acceptor and σ-donor properties of various phosphorus ligands,
Inorg. Chem., 1978, 17, 2269. [all data]
Cowley, Goodman, et al., 1977
Cowley, A.H.; Goodman, D.W.; Kuebler, N.A.; Sanchez, M.; Verkade, J.G.,
Molecular photoelectron spectroscopic investigation of some caged phosphorus compounds and related acyclic species,
Inorg. Chem., 1977, 16, 854. [all data]
Cowley, Lattman, et al., 1982
Cowley, A.H.; Lattman, M.; Stricklen, P.M.; Verkade, J.G.,
UV photoelectron spectroscopic investigation of some polycyclic group 5A compounds and related acyclic species. 1. Free and coordinated aminophosphines and related compounds,
Inorg. Chem., 1982, 21, 543. [all data]
Lappert, Pedley, et al., 1975
Lappert, M.F.; Pedley, J.B.; Wilkins, B.T.; Stelzer, O.; Unger, E.,
Bonding studies of compounds of boron and the group 3-5 elements. Part XIII. He(I) photoelectron spectra of phosphines RnPX3-n (R=Me or Bu'; X=H, Cl, or F; n=1-3), (Me2N)nPCl3-n(n=1-3), and (R2N)PF2(R=Me or Et),
J. Chem. Soc. Dalton Trans., 1975, 1207. [all data]
Cowley, Dewar, et al., 1973
Cowley, A.H.; Dewar, M.J.S.; Goodman, D.W.; Schweiger, J.R.,
Stereochemical dependence of lone pair interactions in the photoelectron spectra of nitrogen-phosphorus compounds,
J. Am. Chem. Soc., 1973, 95, 6506. [all data]