Dichloromethylene
- Formula: CCl2
- Molecular weight: 82.917
- IUPAC Standard InChIKey: PFBUKDPBVNJDEW-UHFFFAOYSA-N
- CAS Registry Number: 1605-72-7
- Chemical structure:
View 3d structure (requires JavaScript / HTML 5) - Permanent link for this species. Use this link for bookmarking this species for future reference.

Gas phase thermochemistry data

Quantity | Value | Units | Method | Reference | Comment |
---|---|---|---|---|---|
ΔfH°gas | 238.49 | kJ/mol | Review | Chase, 1998 | Data last reviewed in December, 1968 |
Quantity | Value | Units | Method | Reference | Comment |
S°gas,1 bar | 265.33 | J/mol*K | Review | Chase, 1998 | Data last reviewed in December, 1968 |
Gas Phase Heat Capacity (Shomate Equation)
Cp° = A + B*t + C*t2 + D*t3 +
E/t2
H° − H°298.15= A*t + B*t2/2 +
C*t3/3 + D*t4/4 − E/t + F − H
S° = A*ln(t) + B*t + C*t2/2 + D*t3/3 −
E/(2*t2) + G
Cp = heat capacity (J/mol*K)
H° = standard enthalpy (kJ/mol)
S° = standard entropy (J/mol*K)
t = temperature (K) / 1000.
View plot Requires a JavaScript / HTML 5 canvas capable browser.
Temperature (K) | 298. to 1700. | 1700. to 6000. |
---|---|---|
A | 55.20579 | 101.2202 |
B | -6.434992 | -18.23308 |
C | 16.46990 | 2.956063 |
D | -5.290501 | -0.168778 |
E | -0.749371 | -35.72743 |
F | 219.6638 | 149.3491 |
G | 329.1599 | 329.8900 |
H | 238.4884 | 238.4884 |
Reference | Chase, 1998 | Chase, 1998 |
Comment | Data last reviewed in December, 1968 | Data last reviewed in December, 1968 |

Gas phase ion energetics data

Data evaluated as indicated in comments:
HL - Edward P. Hunter and Sharon G. Lias
Data compiled as indicated in comments:
LL - Sharon G. Lias and Joel F. Liebman
RDSH - Henry M. Rosenstock, Keith Draxl, Bruce W. Steiner, and John T. Herron
B - John E. Bartmess
Quantity | Value | Units | Method | Reference | Comment |
---|---|---|---|---|---|
Proton affinity (review) | 861. | kJ/mol | N/A | Hunter and Lias, 1998 | HL |
Quantity | Value | Units | Method | Reference | Comment |
Gas basicity | 828.5 | kJ/mol | N/A | Hunter and Lias, 1998 | HL |
Electron affinity determinations
EA (eV) | Method | Reference | Comment |
---|---|---|---|
1.5930 ± 0.0060 | LPES | Wren, Vogelhuber, et al., 2009 | revision: earlier had HCCl2- contaminant. Triplet ca.0.9±0.2 eV up; B |
1.66 ± 0.14 | IMRB | Born, Ingemann, et al., 2000 | Between oCHO-nitrobenzene, 3,5-diCF3-nitrobenzene; B |
1.590 ± 0.070 | LPES | Schwartz, Davico, et al., 1999 | T > S by 3±3 kcal/mol. But Barden and Schaeffer, 2000: EA(triplet)>laser energy.Calc: 19.5±2 kcal. See also Dyke, Lee, et al., 2005.; B |
1.6030 ± 0.0080 | LPES | Murray, Leopold, et al., 1988 | B |
1.80 ± 0.30 | NBAE | Dispert and Lacmann, 1978 | From CCl4,CFCl3,CHCl3; B |
2.50 ± 0.60 | EIAE | Scheunemann, Illenberger, et al., 1980 | From CCl4, CHCl3, CH2Cl2; B |
Ionization energy determinations
IE (eV) | Method | Reference | Comment |
---|---|---|---|
9.27 ± 0.04 | PE | Kohn, Robles, et al., 1993 | LL |
9.76 | EI | Shapiro and Lossing, 1968 | RDSH |
Appearance energy determinations
Ion | AE (eV) | Other Products | Method | Reference | Comment |
---|---|---|---|---|---|
CCl+ | 16.3 ± 0.2 | Cl | EI | Blanchard and LeGoff, 1957 | RDSH |

Reaction thermochemistry data

Data compiled by: John E. Bartmess
Individual Reactions
(CAS Reg. No. 14478-07-0 • 4294967295) +
= CAS Reg. No. 14478-07-0
By formula: (CAS Reg. No. 14478-07-0 • 4294967295CCl2) + CCl2 = CAS Reg. No. 14478-07-0
Quantity | Value | Units | Method | Reference | Comment |
---|---|---|---|---|---|
ΔrH° | 129. ± 11. | kJ/mol | CIDT | Paulino and Squires, 1991 | gas phase |

References

Chase, 1998
Chase, M.W., Jr.,
NIST-JANAF Themochemical Tables, Fourth Edition,
J. Phys. Chem. Ref. Data, Monograph 9, 1998, 1-1951. [all data]
Hunter and Lias, 1998
Hunter, E.P.; Lias, S.G.,
Evaluated Gas Phase Basicities and Proton Affinities of Molecules: An Update,
J. Phys. Chem. Ref. Data, 1998, 27, 3, 413-656, https://doi.org/10.1063/1.556018
. [all data]
Wren, Vogelhuber, et al., 2009
Wren, S.W.; Vogelhuber, K.M.; Ervin, K.M.; Lineberger, W.C.,
The photoelectron spectrum of CCl2-: the convergence of theory and experiment after a decade of debate,
Phys. Chem. Chem. Phys., 2009, 11, 23, 4745-4753, https://doi.org/10.1039/b822690c
. [all data]
Born, Ingemann, et al., 2000
Born, M.; Ingemann, S.; Nibbering, N.M.M.,
Thermochemical properties of halogen-substituted methanes, methyl radicals, and carbenes in the gas phase,
Int. J. Mass Spectrom., 2000, 194, 2-3, 103-113, https://doi.org/10.1016/S1387-3806(99)00125-6
. [all data]
Schwartz, Davico, et al., 1999
Schwartz, R.L.; Davico, G.E.; Ramond, T.M.; Lineberger, W.C.,
Singlet-triplet splittings in CX2 (X = F, Cl, Br, I) dihalocarbenes via negative ion photoelectron spectroscopy,
J. Phys. Chem. A, 1999, 103, 41, 8213-8221, https://doi.org/10.1021/jp992214c
. [all data]
Barden and Schaeffer, 2000
Barden, C.J.; Schaeffer, H.F., III,
The Singlet-Triplet Energy Separation in Dichlorocarbene: a Surprising Difference Between Theory and Experiment,
J. Chem. Phys., 2000, 112, 15, 6515-6516, https://doi.org/10.1063/1.481601
. [all data]
Dyke, Lee, et al., 2005
Dyke, J.M.; Lee, E.P.F.; Mok, D.K.W.; Chau, F.T.,
A combined ab initio/Franck-Condon study of the A-X single-vibronic-level emission spectrum of CCl2 and the photodetachment spectrum of CCl2-,
ChemPhysChem, 2005, 6, 10, 2046-2059, https://doi.org/10.1002/cphc.200500194
. [all data]
Murray, Leopold, et al., 1988
Murray, K.K.; Leopold, D.G.; Miller, T.M.; Lineberger, W.C.,
Photoelectron Spectroscopy of the Halocarbene Anions HCF-, HCCl-, HCBr-, HCI-, CF2-, and CCl2-,
J. Chem. Phys., 1988, 89, 9, 5442, https://doi.org/10.1063/1.455596
. [all data]
Dispert and Lacmann, 1978
Dispert, H.; Lacmann, K.,
Negative ion formation in collisions between potassium and fluoro- and chloromethanes: Electron affinities and bond dissociation energies,
Int. J. Mass Spectrom. Ion Phys., 1978, 28, 49. [all data]
Scheunemann, Illenberger, et al., 1980
Scheunemann, H.U.; Illenberger, E.; Baumgartel, H.,
Dissociative electron attachment to CCl4, CHCl3, CH2Cl2, and CH3Cl,
Ber. Bunsen-Ges. Phys. Chem., 1980, 84, 580. [all data]
Kohn, Robles, et al., 1993
Kohn, D.W.; Robles, E.S.J.; Logan, C.F.; Chen, P.,
Photoelectron spectrum, ionization potential, and heat of formation of CCl2,
J. Phys. Chem., 1993, 97, 4936. [all data]
Shapiro and Lossing, 1968
Shapiro, J.S.; Lossing, F.P.,
Free radicals by mass spectrometry. XXXVII. The ionization potential and heat of formation of dichlorocarbene,
J. Phys. Chem., 1968, 72, 1552. [all data]
Blanchard and LeGoff, 1957
Blanchard, L.P.; LeGoff, P.,
Mass spectrometric study of the species CS, SO, and CCl2 produced in primary heterogeneous reactions,
Can. J. Chem., 1957, 35, 89. [all data]