2,7-Disilaoct-4-ene, 2,2,7,7-tetramethyl-, (E)-
- Formula: C10H24Si2
- Molecular weight: 200.4686
- IUPAC Standard InChIKey: DHTZZPHEAHKIBY-BQYQJAHWSA-N
- CAS Registry Number: 16054-35-6
- Chemical structure:
View 3d structure (requires JavaScript / HTML 5) - Permanent link for this species. Use this link for bookmarking this species for future reference.

Gas phase ion energetics data

Data compiled as indicated in comments:
LLK - Sharon G. Lias, Rhoda D. Levin, and Sherif A. Kafafi
RDSH - Henry M. Rosenstock, Keith Draxl, Bruce W. Steiner, and John T. Herron
Ionization energy determinations
IE (eV) | Method | Reference | Comment |
---|---|---|---|
7.95 ± 0.04 | EI | Bock and Seidl, 1968 | RDSH |
8.30 | PE | Bock and Kaim, 1980 | Vertical value; LLK |

References

Bock and Seidl, 1968
Bock, H.; Seidl, H.,
d-Orbitaleffekte in siliziumsubstituierten π-Elektronensystemen. VI. Spektroskopische Untersuchungen an Alkyl- und Silylathylenen,
J. Organometal. Chem., 1968, 13, 87. [all data]
Bock and Kaim, 1980
Bock, H.; Kaim, W.,
Radical ions. 37. Ionization and one-electron oxidation of electron-rich silylalkyl olefins,
J. Am. Chem. Soc., 1980, 102, 4429. [all data]