2,5-Dimethyl-2,5-bis(trimethylsilyl)hex-3-ene

Gas phase ion energetics data

Data compiled by: Sharon G. Lias, Rhoda D. Levin, and Sherif A. Kafafi

Ionization energy determinations

IE (eV) Method Reference Comment
7.90PEBock and Kaim, 1980Vertical value

References

Bock and Kaim, 1980
Bock, H.; Kaim, W., Radical ions. 37. Ionization and one-electron oxidation of electron-rich silylalkyl olefins, J. Am. Chem. Soc., 1980, 102, 4429. [all data]