1,1-Dimethyl-1-silacyclo-3-pentene
- Formula: C6H12Si
- Molecular weight: 112.2450
- IUPAC Standard InChIKey: PBYZVYQHXMJOLS-UHFFFAOYSA-N
- CAS Registry Number: 16054-12-9
- Chemical structure:
View 3d structure (requires JavaScript / HTML 5) - Other names: Silacyclopent-3-ene,1,1-dimethyl-

Phase change data

Data compiled by: William E. Acree, Jr., James S. Chickos
Enthalpy of fusion
ΔfusH (kJ/mol) | Temperature (K) | Reference |
---|---|---|
7.77 | 166.8 | Bykova, Lebedev, et al., 2000 |

Gas phase ion energetics data

Data compiled as indicated in comments:
LLK - Sharon G. Lias, Rhoda D. Levin, and Sherif A. Kafafi
Ionization energy determinations
IE (eV) | Method | Reference | Comment |
---|---|---|---|
9.0 | PE | Khvostenko, Zykov, et al., 1981 | Vertical value; LLK |
9.1 ± 0.03 | PE | Guimon, Pfister-Guillouzo, et al., 1978 | Vertical value; LLK |
9.0 | PE | Schweig, Weidner, et al., 1972 | Vertical value; LLK |

References

Bykova, Lebedev, et al., 2000
Bykova, T.A.; Lebedev, B.V.; Ushakov, N.V.; Finkel'shtein, E.Sh.,
Thermodynamics of the metathesis polymerization of 1,1-dimethyl-1-silacyclopent-3-ene in bulk and the thermodynamic properties of the resulting polymer in the 0-340 K range,
Polymer Sci. Ser. A, 2000, 42, 8, 863. [all data]
Khvostenko, Zykov, et al., 1981
Khvostenko, V.I.; Zykov, B.G.; Yuriev, V.P.; Mironov, V.F.; Kovel'zon, G.I.; Panasenko, A.A.; Sheludyakov, V.D.; Gailyunas, I.A.,
Study of d(π)-p(π) interaction in vinyl- and alkylsilicon-containing compounds by photoelectron spectroscopy,
J. Organomet. Chem., 1981, 218, 155. [all data]
Guimon, Pfister-Guillouzo, et al., 1978
Guimon, C.; Pfister-Guillouzo, G.; Manuel, G.; Mazerolles, P.,
Structure electronique de silacyclopentenes-2 et-3,
J. Organomet. Chem., 1978, 149, 149. [all data]
Schweig, Weidner, et al., 1972
Schweig, A.; Weidner, U.; Manuel, G.,
Photoelektronen-Spektroskopie und transannulare Wechselwirkungen - Zur Frage transannularer d-π-Wechselwirkung in 1-Sila- und 1-Germa-3- cyclopentenen,
Angew. Chem., 1972, 84, 899. [all data]