Thiophene, tetrahydro-, 1-oxide
- Formula: C4H8OS
- Molecular weight: 104.171
- IUPAC Standard InChIKey: ISXOBTBCNRIIQO-UHFFFAOYSA-N
- CAS Registry Number: 1600-44-8
- Chemical structure:
View 3d structure (requires JavaScript / HTML 5) - Other names: Tetrahydrothiophene oxide; Tetrahydrothiophene 1-oxide; Tetramethylene sulfoxide; Thiophane monoxide; Thiophane oxide; Thiophane 1-oxide; Thiophene-1-oxide, tetrahydro-; Thiolane 1-oxide; Tetramethylene sulphoxide; Tetrametylene sulfoxide; NSC 65433; Tetrahydrothiophene S-oxide

Phase change data

Data compiled by: William E. Acree, Jr., James S. Chickos
Enthalpy of fusion
ΔfusH (kJ/mol) | Temperature (K) | Method | Reference |
---|---|---|---|
0.51 | 231.8 | DSC | Haines and Gilson, 1990 |

Gas phase ion energetics data

Data compiled as indicated in comments:
LLK - Sharon G. Lias, Rhoda D. Levin, and Sherif A. Kafafi
B - John E. Bartmess
Electron affinity determinations
EA (eV) | Reference | Comment |
---|---|---|
0.017521 ± 0.000087 | Hammer, Diri, et al., 2003 | B |
Ionization energy determinations
IE (eV) | Method | Reference | Comment |
---|---|---|---|
9.07 ± 0.05 | EI | Distefano, Foffani, et al., 1971 | LLK |
9.07 | EI | Distefano, Foffani, et al., 1971, 2 | LLK |
8.77 | PE | Bock and Solouki, 1974 | Vertical value; LLK |
8.77 | PE | Bock and Solouki, 1972 | Vertical value; LLK |

References

Haines and Gilson, 1990
Haines, Julian; Gilson, D.F.R.,
Investigation of the phase-transition behaviour in solid tetramethylene sulphoxide,
Faraday Trans., 1990, 86, 14, 2617, https://doi.org/10.1039/ft9908602617
. [all data]
Hammer, Diri, et al., 2003
Hammer, N.I.; Diri, K.; Jordan, K.D.; Desfrancois, C.; Compton, R.N.,
Dipole-bound anions of carbonyl, nitrile, and sulfoxide containing molecules,
J. Chem. Phys., 2003, 119, 7, 3650-3660, https://doi.org/10.1063/1.1590959
. [all data]
Distefano, Foffani, et al., 1971
Distefano, G.; Foffani, A.; Innorta, G.; Pignataro, S.,
Mass spectrometric study of transition metal complexes with ligands having nitrogen or sulphur as donor atom,
Adv. Mass Spectrom., 1971, 5, 696. [all data]
Distefano, Foffani, et al., 1971, 2
Distefano, G.; Foffani, A.; Innorta, G.; Pignataro, S.,
Electron impact ionization potentials of some manganese, chromium and tungsten organometallic derivatives,
Int. J. Mass Spectrom. Ion Phys., 1971, 7, 383. [all data]
Bock and Solouki, 1974
Bock, H.; Solouki, B.,
Photoelektronenspektren und molekuleigenschaften, XXXV. Sulfoxide X2SO - beispiele fur den nutzen von korrelations - diagrammen bei der diskussion von substituenteneffekten und von geometrischen storungen,
Chem. Ber., 1974, 107, 2299. [all data]
Bock and Solouki, 1972
Bock, H.; Solouki, B.,
The sulfoxide bond,
Angew. Chem. Int. Ed. Engl., 1972, 11, 436. [all data]