Benzene, 1-butyl-3-methyl-
- Formula: C11H16
- Molecular weight: 148.2447
- IUPAC Standard InChIKey: OAPCPUDMDJIBOQ-UHFFFAOYSA-N
- CAS Registry Number: 1595-04-6
- Chemical structure:
View 3d structure (requires JavaScript / HTML 5) - Other names: Toluene, m-butyl-; 1-Methyl-3-n-Butylbenzene; Benzene, 1-methyl-3-butyl-

Phase change data

Data compiled as indicated in comments:
BS - Robert L. Brown and Stephen E. Stein
TRC - Thermodynamics Research Center, NIST Boulder Laboratories, Chris Muzny director
Quantity | Value | Units | Method | Reference | Comment |
---|---|---|---|---|---|
Tboil | 478.2 | K | N/A | Weast and Grasselli, 1989 | BS |
Tboil | 471. | K | N/A | Niemczycki, 1899 | Uncertainty assigned by TRC = 5. K; TRC |
Reduced pressure boiling point
Tboil (K) | Pressure (bar) | Reference | Comment |
---|---|---|---|
470.2 | 1.01 | Aldrich Chemical Company Inc., 1990 | BS |

Gas phase ion energetics data

Data compiled as indicated in comments:
LLK - Sharon G. Lias, Rhoda D. Levin, and Sherif A. Kafafi
Ionization energy determinations
IE (eV) | Method | Reference | Comment |
---|---|---|---|
8.4 ± 0.1 | EI | Lightner, Majeti, et al., 1972 | LLK |
Appearance energy determinations
Ion | AE (eV) | Other Products | Method | Reference | Comment |
---|---|---|---|---|---|
C8H9+ | 11.4 ± 0.1 | ? | EI | Lightner, Majeti, et al., 1972 | LLK |
C8H10+ | 10.3 ± 0.1 | CH2=CHCH3 | EI | Lightner, Majeti, et al., 1972 | LLK |

Kovats' RI, non-polar column, isothermal

Column type | Active phase | Temperature (C) | I | Reference | Comment |
---|---|---|---|---|---|
Capillary | OV-101 | 100. | 1140. | Matisová, Kovacicová, et al., 1989 | He; Column length: 50. m; Column diameter: 0.20 mm |
Capillary | Squalane | 100. | 1130. | Nabivach and Vasiliev, 1987 | |
Capillary | OV-101 | 100. | 1141. | Gerasimenko and Nabivach, 1982 | N2; Column length: 50. m; Column diameter: 0.30 mm |
Capillary | OV-101 | 120. | 1146. | Gerasimenko and Nabivach, 1982 | N2; Column length: 50. m; Column diameter: 0.30 mm |
Capillary | OV-101 | 140. | 1152. | Gerasimenko and Nabivach, 1982 | N2; Column length: 50. m; Column diameter: 0.30 mm |
Capillary | OV-101 | 100. | 1140.7 | Gerasimenko, Kirilenko, et al., 1981 | N2; Column length: 50. m; Column diameter: 0.3 mm |
Capillary | OV-101 | 120. | 1145.7 | Gerasimenko, Kirilenko, et al., 1981 | N2; Column length: 50. m; Column diameter: 0.3 mm |
Capillary | OV-101 | 140. | 1151.5 | Gerasimenko, Kirilenko, et al., 1981 | N2; Column length: 50. m; Column diameter: 0.3 mm |

Kovats' RI, non-polar column, custom temperature program

Column type | Active phase | I | Reference | Comment |
---|---|---|---|---|
Capillary | Petrocol DH-100 | 1140.6 | Haagen-Smit Laboratory, 1997 | He; Column length: 100. m; Column diameter: 0.2 mm; Program: 5C(10min) => 5C/min => 50C(48min) => 1.5C/min => 195C(91min) |
Capillary | DB-1 | 1133. | Hoekman, 1993 | 60. m/0.32 mm/1.0 μm, He; Program: -40 C for 12 min; -40 - 125 C at 3 deg.min; 125-185 C at 6 deg/min; 185 - 220 C at 20 deg/min; hold 220 C for 2 min |

Kovats' RI, polar column, isothermal

Column type | Active phase | Temperature (C) | I | Reference | Comment |
---|---|---|---|---|---|
Capillary | Carbowax 20M | 90. | 1370.8 | Döring, Estel, et al., 1974 | Column length: 100. m; Column diameter: 0.2 mm |

Van Den Dool and Kratz RI, non-polar column, temperature ramp

Column type | Active phase | I | Reference | Comment |
---|---|---|---|---|
Capillary | Petrocol DH | 1130. | White, Hackett, et al., 1992 | 100. m/0.25 mm/0.5 μm, He, 1. K/min; Tstart: 30. C; Tend: 220. C |

Normal alkane RI, non-polar column, isothermal

Column type | Active phase | Temperature (C) | I | Reference | Comment |
---|---|---|---|---|---|
Capillary | Methyl Silicone | 120. | 1141. | Chen and Feng, 2006 | |
Capillary | Methyl Silicone | 120. | 1152. | Chen and Feng, 2006 | |
Capillary | OV-101 | 100. | 1140. | Tian, 1993 | Column length: 50. m; Column diameter: 0.20 mm |
Capillary | OV-101 | 100. | 1141. | Tian, 1993 | Column length: 50. m; Column diameter: 0.20 mm |
Capillary | OV-101 | 120. | 1144. | Tian, 1993 | Column length: 50. m; Column diameter: 0.20 mm |
Capillary | OV-101 | 120. | 1146. | Tian, 1993 | Column length: 50. m; Column diameter: 0.20 mm |

Normal alkane RI, non-polar column, temperature ramp

Column type | Active phase | I | Reference | Comment |
---|---|---|---|---|
Capillary | OV-101 | 1140. | Matisová, Kovacicová, et al., 1989 | He, 1. K/min; Column length: 50. m; Column diameter: 0.20 mm; Tstart: 80. C; Tend: 190. C |

Normal alkane RI, non-polar column, custom temperature program

Column type | Active phase | I | Reference | Comment |
---|---|---|---|---|
Capillary | SE-30 | 1140. | Xiuhua, Zhang, et al., 1996 | Program: not specified |
Capillary | OV-101 | 1139. | Matisová, Juranyiová, et al., 1991 | 52. m/0.25 mm/0.38 μm, H2; Program: 70 - 160 C at 1.5 deg/min; 160 - 280 C at 15 deg/min 15 min at 280 C |

Normal alkane RI, polar column, isothermal

Column type | Active phase | Temperature (C) | I | Reference | Comment |
---|---|---|---|---|---|
Capillary | Carbowax 20M | 90. | 1371. | Sutter, Peterson, et al., 1997 |

Normal alkane RI, polar column, custom temperature program

Column type | Active phase | I | Reference | Comment |
---|---|---|---|---|
Capillary | Carbowax 20M | 1371. | Ivanciuc, Ivanciuc, et al., 2001 | Program: not specified |

References

Weast and Grasselli, 1989
CRC Handbook of Data on Organic Compounds, 2nd Editon, Weast,R.C and Grasselli, J.G., ed(s)., CRC Press, Inc., Boca Raton, FL, 1989, 1. [all data]
Niemczycki, 1899
Niemczycki, S.,
Bull. Int. Acad. Sci. Cracovie, 1899, 473. [all data]
Aldrich Chemical Company Inc., 1990
Aldrich Chemical Company Inc.,
Catalog Handbook of Fine Chemicals, Aldrich Chemical Company, Inc., Milwaukee WI, 1990, 1. [all data]
Lightner, Majeti, et al., 1972
Lightner, D.A.; Majeti, S.; Nicoletti, R.; Thommen, E.,
Benzyl vs. tropylium ions in the electron impact induced decomposition of n- butylbenzenes,
Intra-Sci. Chem. Rep., 1972, 6, 113. [all data]
Matisová, Kovacicová, et al., 1989
Matisová, E.; Kovacicová, E.; Ha, P.T.; Kolek, E.; Engewald, W.,
Identification of alkylbenzenes up to C12 by capillary gas chromatography-mass spectrometry. II. Retention indices on OV-101 columns and retention-molecular structure correlations,
J. Chromatogr., 1989, 475, 2, 113-123, https://doi.org/10.1016/S0021-9673(01)89667-9
. [all data]
Nabivach and Vasiliev, 1987
Nabivach, V.M.; Vasiliev, E.E.E.,
Correlation dependencies of GC retention indices from physical chemical properties and structures of aromatic hydrocarbons,
Izv. Vyssh. Uchebn. Zaved. Khim. Khim. Tekhnol., 1987, 30, 72-75. [all data]
Gerasimenko and Nabivach, 1982
Gerasimenko, V.A.; Nabivach, V.M.,
Relationship between molecular structure and gas chromatographic retention of alkylbenzenes C8-C1 2 on polydimethylsiloxane,
Zh. Anal. Khim., 1982, 37, 110-116. [all data]
Gerasimenko, Kirilenko, et al., 1981
Gerasimenko, V.A.; Kirilenko, A.V.; Nabivach, V.M.,
Capillary gas chromatography of aromatic compounds found in coal tar fractions,
J. Chromatogr., 1981, 208, 1, 9-16, https://doi.org/10.1016/S0021-9673(00)87953-4
. [all data]
Haagen-Smit Laboratory, 1997
Haagen-Smit Laboratory,
Procedure for the detailed hydrocarbon analysis of gasolines by single column high efficiency (capillary) column gas chromatography, SOP NO. MLD 118, Revision No. 1.1, California Environmental Protection Agency, Air Resources Board, El Monte, California, 1997, 22. [all data]
Hoekman, 1993
Hoekman, S.K.,
Improved gas chromatography procedure for speciated hydrocarbon measurements of vehicle emissions,
J. Chromatogr., 1993, 639, 2, 239-253, https://doi.org/10.1016/0021-9673(93)80260-F
. [all data]
Döring, Estel, et al., 1974
Döring, C.E.; Estel, D.; Fischer, R.,
Kapillar-gaschromatographische Charakterisierung von C10-bis C12-Aromaten,
J. Prakt. Chem., 1974, 316, 1, 1-12, https://doi.org/10.1002/prac.19743160102
. [all data]
White, Hackett, et al., 1992
White, C.M.; Hackett, J.; Anderson, R.R.; Kail, S.; Spock, P.S.,
Linear temperature programmed retention indices of gasoline range hydrocarbons and chlorinated hydrocarbons on cross-linked polydimethylsiloxane,
J. Hi. Res. Chromatogr., 1992, 15, 2, 105-120, https://doi.org/10.1002/jhrc.1240150211
. [all data]
Chen and Feng, 2006
Chen, Y.; Feng, C.-I.,
Regerating the spent metal-contaminated cracking catalyst by ozalic acid,
J. Shanxi Univ. (Nat. Sci. Ed.), 2006, 29, 4, 414-420. [all data]
Tian, 1993
Tian, S.,
Analysis of the tower bottom oil of dimethylbenzene rectifying tower and C9 aromatic hydrocarbon fraction by capillary gas chromatography,
Chin. J. Chromatogr., 1993, 11, 4, 202-206. [all data]
Xiuhua, Zhang, et al., 1996
Xiuhua, Zh.; Zhang, L.; Che, X.,
Prediction of the Kovats retention indexes of polysubstituted alkylbenzenes,
Chin. J. Chromatogr., 1996, 14, 4, 244-248. [all data]
Matisová, Juranyiová, et al., 1991
Matisová, E.; Juranyiová, E.; Kurán, P.; Brandsteterová, E.; Kocan, A.; Holotík, S.,
Analysis of multicomponent mixtures by high-resolution capillary gas chromatography and combined gas chromatography-mass spectrometry. I. Aromatics in a hydrocarbon matrix,
J. Chromatogr., 1991, 552, 301-312, https://doi.org/10.1016/S0021-9673(01)95946-1
. [all data]
Sutter, Peterson, et al., 1997
Sutter, J.M.; Peterson, T.A.; Jurs, P.C.,
Prediction of gas chromatographic retention indices of alkylbenzenes,
Anal. Chim. Acta., 1997, 342, 2-3, 113-122, https://doi.org/10.1016/S0003-2670(96)00578-8
. [all data]
Ivanciuc, Ivanciuc, et al., 2001
Ivanciuc, O.; Ivanciuc, T.; Klein, D.J.; Seitz, W.A.; Balaban, A.T.,
Quantitative structure-retention relationships for gas chromatographic retention indices of alkylbenzenes with molecular graph descriptors,
SAR QSAR Environ. Res., 2001, 11, 5-6, 419-452, https://doi.org/10.1080/10629360108035362
. [all data]