Dicyclopropylethanedione
- Formula: C8H10O2
- Molecular weight: 138.1638
- IUPAC Standard InChIKey: UKHLNGHTXWIWGW-UHFFFAOYSA-N
- CAS Registry Number: 15940-88-2
- Chemical structure:
View 3d structure (requires JavaScript / HTML 5) - Permanent link for this species. Use this link for bookmarking this species for future reference.

Gas phase ion energetics data

Data compiled as indicated in comments:
LLK - Sharon G. Lias, Rhoda D. Levin, and Sherif A. Kafafi
Ionization energy determinations
IE (eV) | Method | Reference | Comment |
---|---|---|---|
8.8 | PE | Kelder, Cerfontain, et al., 1974 | LLK |
9.09 | PE | Kelder, Cerfontain, et al., 1974 | Vertical value; LLK |

References

Kelder, Cerfontain, et al., 1974
Kelder, J.; Cerfontain, H.; Higginson, B.R.; Lloyd, D.R.,
Photoelectron and ultraviolet absorption spectra of cyclopropyl conjugated 1,2-diketones,
Tetrahedron Lett., 1974, 739. [all data]
Kelder, et al., 1974
Kelder, J., et al.,
Tetrahedron LettersJ., 1974, 739. [all data]