1-Phenylcyclohexanol
- Formula: C12H16O
- Molecular weight: 176.2548
- IUPAC Standard InChIKey: DTTDXHDYTWQDCS-UHFFFAOYSA-N
- CAS Registry Number: 1589-60-2
- Chemical structure:
View 3d structure (requires JavaScript / HTML 5) - Other names: Cyclohexanol, 1-phenyl-; 1-Phenyl-1-cyclohexanol; 1-Phenylcyclohexanol-1; Benzene, cyclohex-1-yl-1-ol-

Phase change data

Data compiled by: Thermodynamics Research Center, NIST Boulder Laboratories, Chris Muzny director
Quantity | Value | Units | Method | Reference | Comment |
---|---|---|---|---|---|
Tfus | 333. | K | N/A | Nenitzescu and Necsoiu, 1950 | Uncertainty assigned by TRC = 4. K |
Tfus | 333. | K | N/A | Signaigo and Cramer, 1933 | Uncertainty assigned by TRC = 3. K |

Gas phase ion energetics data

Data compiled by: Sharon G. Lias, Rhoda D. Levin, and Sherif A. Kafafi
Ionization energy determinations
IE (eV) | Method | Reference |
---|---|---|
8.0 | EI | Mikaya, Zaikin, et al., 1979 |
Appearance energy determinations
Ion | AE (eV) | Other Products | Method | Reference | Comment |
---|---|---|---|---|---|
C8H8O+ | 9.8 | C4H8 | EI | Mikaya, Zaikin, et al., 1979 |

References

Nenitzescu and Necsoiu, 1950
Nenitzescu, C.D.; Necsoiu, I.,
The Synthesis of Cyclic Alcohols nd Olefins by the Interaction of Dimagnesium Halides and Esters,
J. Am. Chem. Soc., 1950, 72, 3483. [all data]
Signaigo and Cramer, 1933
Signaigo, F.K.; Cramer, P.L.,
The preparation of some mono- and dialkylcylohexanes,
J. Am. Chem. Soc., 1933, 55, 3326-32. [all data]
Mikaya, Zaikin, et al., 1979
Mikaya, A.I.; Zaikin, V.G.; Finkel'stein, E.S.; Vdovin, V.M.,
Mass-spectrometric investigation of aromatic derivatives of cycloalkanes and cycloalkanols,
Izv. Akad. Nauk SSSR, Ser. Khim., 1979, 10, 2221. [all data]
Lavruchin, Verkhovod, et al., 1955
Lavruchin, V.F.; Verkhovod, N.N.; Movchan, P.K.,
Halochromism of tertiary alicyclic and aliphatic carbinols,
Dokl. Akad. Nauk SSSR, 1955, 105, 4, 723-726. [all data]