1-Propanol, 2-methoxy-
- Formula: C4H10O2
- Molecular weight: 90.1210
- IUPAC Standard InChIKey: YTTFFPATQICAQN-UHFFFAOYSA-N
- CAS Registry Number: 1589-47-5
- Chemical structure:
View 3d structure (requires JavaScript / HTML 5) - Other names: 2-Methoxy-1-propanol; 2-Methoxypropanol

Gas phase ion energetics data

Data compiled by: Sharon G. Lias, Rhoda D. Levin, and Sherif A. Kafafi
Appearance energy determinations
Ion | AE (eV) | Other Products | Method | Reference | Comment |
---|---|---|---|---|---|
C3H7O+ | 9.68 | CH2OH | EI | Lossing, 1977 |

Kovats' RI, non-polar column, isothermal

Data compiled by: NIST Mass Spectrometry Data Center, William E. Wallace, director

Column type PackedPacked
Active phase Apiezon LApiezon L
Column length (m)
Carrier gas
Substrate Celite 545Celite 545
Column diameter (mm)
Phase thickness (μm)
Temperature (C) 120.160.
I 661.664.
ReferenceBogoslovsky, Anvaer, et al., 1978Bogoslovsky, Anvaer, et al., 1978
Comment MSDC-RI MSDC-RI

References

Lossing, 1977
Lossing, F.P.,
Heats of formation of some isomeric [CnH2n+1]+ ions. Substitutional effects on ion stability,
J. Am. Chem. Soc., 1977, 99, 7526. [all data]