Benzene, 1-methyl-2-(2-propenyl)-
- Formula: C10H12
- Molecular weight: 132.2023
- IUPAC Standard InChIKey: SVIHJJUMPAUQNO-UHFFFAOYSA-N
- CAS Registry Number: 1587-04-8
- Chemical structure:
View 3d structure (requires JavaScript / HTML 5) - Other names: Toluene, o-allyl-; o-Allyltoluene; 1-Allyl-2-methylbenzene; 2-Allyl-1-methylbenzene; 2-Allyltoluene; 1-Methyl-2-(2-propenyl)benzene

Phase change data

Data compiled by: Thermodynamics Research Center, NIST Boulder Laboratories, Chris Muzny director
Quantity | Value | Units | Method | Reference | Comment |
---|---|---|---|---|---|
Tboil | 448. | K | N/A | Sabatier and Murat, 1913 | Uncertainty assigned by TRC = 4. K |

Gas phase ion energetics data

Data compiled as indicated in comments:
LBLHLM - Sharon G. Lias, John E. Bartmess, Joel F. Liebman, John L. Holmes, Rhoda D. Levin, and W. Gary Mallard
Ionization energy determinations
IE (eV) | Method | Reference | Comment |
---|---|---|---|
7.78 ± 0.04 | EI | Dass and Gross, 1985 | LBLHLM |

Kovats' RI, non-polar column, isothermal

Column type | Active phase | Temperature (C) | I | Reference | Comment |
---|---|---|---|---|---|
Capillary | SE-30 | 130. | 1055. | Bredael, 1982 | Column length: 100. m; Column diameter: 0.5 mm |
Capillary | SE-30 | 80. | 1041. | Bredael, 1982 | Column length: 100. m; Column diameter: 0.5 mm |

Kovats' RI, polar column, temperature ramp

Column type | Active phase | I | Reference | Comment |
---|---|---|---|---|
Capillary | Supelcowax-10 | 1446. | Wong and Tie, 1993 | He, 35. C @ 5. min, 3. K/min, 200. C @ 20. min; Column length: 60. m; Column diameter: 0.25 mm |

Van Den Dool and Kratz RI, polar column, temperature ramp

Column type | Active phase | I | Reference | Comment |
---|---|---|---|---|
Capillary | Supelcowax-10 | 1446. | Matiella and Hsieh, 1990 | 60. m/0.25 mm/0.25 μm, 40. C @ 5. min, 2. K/min, 175. C @ 20. min |

Normal alkane RI, non-polar column, temperature ramp

Column type | Active phase | I | Reference | Comment |
---|---|---|---|---|
Capillary | DB-1 | 1004. | Pala-Paul, Brophy, et al., 2007 | 50. m/0.25 mm/0.25 μm, He, 4. K/min; Tstart: 95. C; Tend: 240. C |

Normal alkane RI, non-polar column, custom temperature program

Column type | Active phase | I | Reference | Comment |
---|---|---|---|---|
Capillary | OV-1, SE-30, Methyl silicone, SP-2100, OV-101, DB-1, etc. | 1041. | Waggott and Davies, 1984 | Hydrogen; Column length: 50. m; Column diameter: 0.32 mm; Program: not specified |

Normal alkane RI, polar column, temperature ramp

Column type | Active phase | I | Reference | Comment |
---|---|---|---|---|
Capillary | HP-Innowax | 1442. | Feng, Cui, et al., 2011 | 60. m/0.25 mm/0.25 μm, Helium, 60. C @ 1. min, 5. K/min, 220. C @ 5. min |

References

Sabatier and Murat, 1913
Sabatier, P.; Murat, M.,
Preparation of Three Cymenes and Thre Menthanes,
C. R. Hebd. Seances Acad. Sci., 1913, 156, 184. [all data]
Dass and Gross, 1985
Dass, C.; Gross, M.L.,
The question of cyclic versus acyclic ions: The structure of [C6H10]+ gas phase ions,
Org. Mass Spectrom., 1985, 20, 34. [all data]