Monofluoroamine
- Formula: FH2N
- Molecular weight: 35.0210
- IUPAC Standard InChIKey: MDQRDWAGHRLBPA-UHFFFAOYSA-N
- CAS Registry Number: 15861-05-9
- Chemical structure:
View 3d structure (requires JavaScript / HTML 5) - Permanent link for this species. Use this link for bookmarking this species for future reference.

Gas phase ion energetics data

Data compiled by: Sharon G. Lias and Joel F. Liebman
Ionization energy determinations
IE (eV) | Method | Reference | Comment |
---|---|---|---|
10.83 | PE | Baumgartel, Jochims, et al., 1989 | |
11.62 | PE | Baumgartel, Jochims, et al., 1989 | Vertical value |
Appearance energy determinations
Ion | AE (eV) | Other Products | Method | Reference | Comment |
---|---|---|---|---|---|
FHN+ | 15.2 | H | PE | Baumgartel, Jochims, et al., 1989 | |
FN+ | 14.85 | H2 | PE | Baumgartel, Jochims, et al., 1989 |

Vibrational and/or electronic energy levels

Data compiled by: Marilyn E. Jacox
State: X
Vib. sym. |
No. | Approximate type of mode |
cm-1 | Med. | Method | References | |
---|---|---|---|---|---|---|---|
a' | 1 | NH2 s-stretch | 3269 | H | Ar | IR | Andrews and Lascola, 1987 |
1 | NH2 s-stretch | 3234 | N2 | IR | Baumgartel, Jochims, et al., 1989 | ||
2 | NH2 scissors | 1568 | H | Ar | IR | Andrews and Lascola, 1987 | |
2 | NH2 scissors | 1564 | N2 | IR | Baumgartel, Jochims, et al., 1989 | ||
3 | NH2 wag | 1244 | H | Ar | IR | Andrews and Lascola, 1987 | |
3 | NH2 wag | 1241 | N2 | IR | Baumgartel, Jochims, et al., 1989 | ||
3 | NH2 wag | 1233 | N2 | IR | Baumgartel, Jochims, et al., 1989 | ||
4 | NF stretch | 934 | H | Ar | IR | Andrews and Lascola, 1987 | |
4 | NF stretch | 891 | N2 | IR | Baumgartel, Jochims, et al., 1989 | ||
a | 5 | NH2 a-stretch | 3346 | N2 | IR | Baumgartel, Jochims, et al., 1989 | |
Additional references: Jacox, 1994, page 153; Christen, Minkwitz, et al., 1987

References

Baumgartel, Jochims, et al., 1989
Baumgartel, H.; Jochims, H.-W.; Ruhl, E.; Bock, H.; Dammel, R.; Minkwitz, J.; Nass, R.,
Photoelectron and photoionization mass spectra of the fluoramines NH3-nFn1,
Inorg. Chem., 1989, 28, 943. [all data]