(CH3)2NCl
- Formula: C2H6ClN
- Molecular weight: 79.529
- IUPAC Standard InChIKey: MAGVJLLHDZWQFM-UHFFFAOYSA-N
- CAS Registry Number: 1585-74-6
- Chemical structure:
View 3d structure (requires JavaScript / HTML 5) - Other names: N-Chlorodimethylamine; Chloro-dimethyl-amine

Gas phase ion energetics data

Data compiled as indicated in comments:
LBLHLM - Sharon G. Lias, John E. Bartmess, Joel F. Liebman, John L. Holmes, Rhoda D. Levin, and W. Gary Mallard
LLK - Sharon G. Lias, Rhoda D. Levin, and Sherif A. Kafafi
Ionization energy determinations
IE (eV) | Method | Reference | Comment |
---|---|---|---|
8.75 | PE | Molder, Pikver, et al., 1983 | LBLHLM |
8.67 ± 0.02 | PE | Colbourne, Frost, et al., 1978 | LLK |
9.25 | PE | Carnovale, Gan, et al., 1979 | Vertical value; LLK |

References

Molder, Pikver, et al., 1983
Molder, U.H.; Pikver, R.J.; Koppel, I.A.,
Photoelectron spectra of molecules. 4. Amines,
Org. React. Tartu, 1983, 20, 355. [all data]
Colbourne, Frost, et al., 1978
Colbourne, D.; Frost, D.C.; McDowell, C.A.; Westwood, N.P.C.,
The photoelectron spectra of the chloramines NH2Cl, NHCl2, NCl3 and the methyl chloramines CH3NHCl, CH3NCl2, and (CH3)2NCl,
J. Chem. Phys., 1978, 69, 1078. [all data]
Carnovale, Gan, et al., 1979
Carnovale, F.; Gan, T.H.; Peel, J.B.,
The photoelectron spectra of the N-chloro and N-bromo derivatives of dimethylamine,
Aust. J. Chem., 1979, 32, 719. [all data]
Well and Morris, 1949
Well, I.; Morris, J.C.,
J. Am. Chem. Soc., 1949, 71, 3123. [all data]