Benzene, 1-bromo-4-ethyl-
- Formula: C8H9Br
- Molecular weight: 185.061
- IUPAC Standard InChIKey: URFPRAHGGBYNPW-UHFFFAOYSA-N
- CAS Registry Number: 1585-07-5
- Chemical structure:
View 3d structure (requires JavaScript / HTML 5) - Other names: p-Bromoethylbenzene; p-Ethylbromobenzene; 1-Bromo-4-ethylbenzene; 4-Ethylbromobenzene

Phase change data

Data compiled as indicated in comments:
BS - Robert L. Brown and Stephen E. Stein
TRC - Thermodynamics Research Center, NIST Boulder Laboratories, Chris Muzny director
AC - William E. Acree, Jr., James S. Chickos
Quantity | Value | Units | Method | Reference | Comment |
---|---|---|---|---|---|
Tboil | 477.2 | K | N/A | Weast and Grasselli, 1989 | BS |
Tboil | 478.22 | K | N/A | Dreisbach and Martin, 1949 | Uncertainty assigned by TRC = 0.07 K; TRC |
Quantity | Value | Units | Method | Reference | Comment |
Tfus | 229.68 | K | N/A | Dreisbach and Martin, 1949 | Uncertainty assigned by TRC = 0.05 K; TRC |
Enthalpy of vaporization
ΔvapH (kJ/mol) | Temperature (K) | Method | Reference | Comment |
---|---|---|---|---|
46.2 | 362. | N/A | Dykyj, Svoboda, et al., 1999 | Based on data from 347. to 479. K.; AC |
49.4 | 393. | A | Stephenson and Malanowski, 1987 | Based on data from 378. to 533. K. See also Dykyj and Vanko, 1970.; AC |
52.0 | 318. | N/A | Stull, 1947 | Based on data from 303. to 479. K.; AC |

Reaction thermochemistry data

Data compiled by: Hussein Y. Afeefy, Joel F. Liebman, and Stephen E. Stein
Individual Reactions
= C8H9Br
By formula: C8H9Br = C8H9Br
Quantity | Value | Units | Method | Reference | Comment |
---|---|---|---|---|---|
ΔrH° | -0.80 ± 0.012 | kJ/mol | Eqk | Merdzhanov, Alenin, et al., 1982 | gas phase; Heat of isomerization at 330 K |

Gas phase ion energetics data

Data compiled by: Henry M. Rosenstock, Keith Draxl, Bruce W. Steiner, and John T. Herron
Appearance energy determinations
Ion | AE (eV) | Other Products | Method | Reference | Comment |
---|---|---|---|---|---|
C7H6Br+ | 10.75 | CH3 | EI | Howe and Williams, 1969 | |
C8H9+ | 10.80 | Br | EI | Howe and Williams, 1969 |

References

Weast and Grasselli, 1989
CRC Handbook of Data on Organic Compounds, 2nd Editon, Weast,R.C and Grasselli, J.G., ed(s)., CRC Press, Inc., Boca Raton, FL, 1989, 1. [all data]
Dreisbach and Martin, 1949
Dreisbach, R.R.; Martin, R.A.,
Physical Data on Some Organic Compounds,
Ind. Eng. Chem., 1949, 41, 2875-8. [all data]
Dykyj, Svoboda, et al., 1999
Dykyj, J.; Svoboda, J.; Wilhoit, R.C.; Frenkel, M.L.; Hall, K.R.,
Vapor Pressure of Chemicals: Part A. Vapor Pressure and Antoine Constants for Hydrocarbons and Sulfur, Selenium, Tellurium and Hydrogen Containing Organic Compounds, Springer, Berlin, 1999, 373. [all data]
Stephenson and Malanowski, 1987
Stephenson, Richard M.; Malanowski, Stanislaw,
Handbook of the Thermodynamics of Organic Compounds, 1987, https://doi.org/10.1007/978-94-009-3173-2
. [all data]
Dykyj and Vanko, 1970
Dykyj, J.; Vanko, A.,
Petrochemica, 1970, 10, 1, 3. [all data]
Stull, 1947
Stull, Daniel R.,
Vapor Pressure of Pure Substances. Organic and Inorganic Compounds,
Ind. Eng. Chem., 1947, 39, 4, 517-540, https://doi.org/10.1021/ie50448a022
. [all data]
Merdzhanov, Alenin, et al., 1982
Merdzhanov, V.R.; Alenin, V.I.; Nesterova, T.N.; Rozhnov, A.M.,
Study of equilibrium transformation of ethylbromobenzenes,
Izv. Vyssh. Uchebn. Zaved., Khim. Khim. Tekhnol., 1982, 25, 1047-1049. [all data]
Howe and Williams, 1969
Howe, I.; Williams, D.H.,
Calculation and qualitative predictions of mass spectra. Mono- and paradisubstituted benzenes,
J. Am. Chem. Soc., 1969, 91, 7137. [all data]