Phenanthrene, decafluoro-

Gas phase ion energetics data

Data compiled as indicated in comments:
LLK - Sharon G. Lias, Rhoda D. Levin, and Sherif A. Kafafi

Ionization energy determinations

IE (eV) Method Reference Comment
8.75 ± 0.05PEBastide, Hall, et al., 1979LLK

References

Bastide, Hall, et al., 1979
Bastide, J.; Hall, D.; Heilbronner, E.; Maier, J.P., He(Iα) photoelectron spectra of some higher aromatic perfluoro compounds, J. Electron Spectrosc. Relat. Phenom., 1979, 16, 205. [all data]