Di-(2-furyl)dimethyl silane

Gas phase ion energetics data

Data compiled as indicated in comments:
LBLHLM - Sharon G. Lias, John E. Bartmess, Joel F. Liebman, John L. Holmes, Rhoda D. Levin, and W. Gary Mallard

Ionization energy determinations

IE (eV) Method Reference Comment
8.60PEZykov, Erchak, et al., 1983Vertical value; LBLHLM

References

Zykov, Erchak, et al., 1983
Zykov, B.G.; Erchak, N.P.; Khvostenko, V.I.; Lukevits, E.; Matorykina, V.F.; Asfandiarov, N.L., Photoelectron spectra of furylsilanes and their carbon analogs, J. Organomet. Chem., 1983, 253, 301. [all data]