2,5-Bis(trimethylsilyl)furan
- Formula: C10H20OSi2
- Molecular weight: 212.4362
- IUPAC Standard InChIKey: WRTMWEMDOPVALX-UHFFFAOYSA-N
- CAS Registry Number: 1578-29-6
- Chemical structure:
View 3d structure (requires JavaScript / HTML 5) - Permanent link for this species. Use this link for bookmarking this species for future reference.

Gas phase ion energetics data

Data compiled by: Sharon G. Lias, John E. Bartmess, Joel F. Liebman, John L. Holmes, Rhoda D. Levin, and W. Gary Mallard
Ionization energy determinations
IE (eV) | Method | Reference | Comment |
---|---|---|---|
7.8 | PE | Veszpremi, Nyulaszi, et al., 1987 | |
8.16 | PE | Veszpremi, Nyulaszi, et al., 1987 | Vertical value |
8.12 | PE | Bock and Roth, 1983 | Vertical value |

References

Veszpremi, Nyulaszi, et al., 1987
Veszpremi, T.; Nyulaszi, L.; Nagy, J.,
Ultraviolet photoelectron spectroscopy and quantum-mechanical study of alkyl- and trimethylsilyl-furanes,
J. Organomet. Chem., 1987, 331, 175. [all data]
Bock and Roth, 1983
Bock, H.; Roth, B.,
Radical ions. 49. Redox reactions of some thiophene derivatives,
Phosphorus Sulfur, 1983, 14, 211. [all data]