Phenanthrene, 2,7-dimethyl-
- Formula: C16H14
- Molecular weight: 206.2824
- IUPAC Standard InChIKey: BKPXLOGIVVCOHT-UHFFFAOYSA-N
- CAS Registry Number: 1576-69-8
- Chemical structure:
View 3d structure (requires JavaScript / HTML 5) - Other names: 2,7-Dimethylphenanthrene

Gas phase thermochemistry data

Data compiled by: Hussein Y. Afeefy, Joel F. Liebman, and Stephen E. Stein
Quantity | Value | Units | Method | Reference | Comment |
---|---|---|---|---|---|
ΔfH°gas | 143. ± 3. | kJ/mol | Ccb | Karnes, Kybett, et al., 1965 | see Frisch, Barker, et al., 1963 and Frisch, 1962 |

Condensed phase thermochemistry data

Data compiled by: Hussein Y. Afeefy, Joel F. Liebman, and Stephen E. Stein
Quantity | Value | Units | Method | Reference | Comment |
---|---|---|---|---|---|
ΔfH°solid | 36.4 ± 2.3 | kJ/mol | Ccb | Frisch, 1962 | see Frisch, Barker, et al., 1963 |
Quantity | Value | Units | Method | Reference | Comment |
ΔcH°solid | -8333.4 ± 1.7 | kJ/mol | Ccb | Frisch, 1962 | see Frisch, Barker, et al., 1963; Corresponding ΔfHºsolid = 36.4 kJ/mol (simple calculation by NIST; no Washburn corrections) |

Phase change data

Data compiled by: Hussein Y. Afeefy, Joel F. Liebman, and Stephen E. Stein
Quantity | Value | Units | Method | Reference | Comment |
---|---|---|---|---|---|
ΔsubH° | 107. ± 0.8 | kJ/mol | C | Karnes, Kybett, et al., 1965 | see Frisch, Barker, et al., 1963 and Frisch, 1962 |

Gas phase ion energetics data

Data compiled as indicated in comments:
LLK - Sharon G. Lias, Rhoda D. Levin, and Sherif A. Kafafi
RDSH - Henry M. Rosenstock, Keith Draxl, Bruce W. Steiner, and John T. Herron
Ionization energy determinations
IE (eV) | Method | Reference | Comment |
---|---|---|---|
8.0 ± 0.1 | EI | Dougherty, Bertorello, et al., 1971 | LLK |
7.98 ± 0.05 | EI | Nounou, 1966 | RDSH |
Appearance energy determinations
Ion | AE (eV) | Other Products | Method | Reference | Comment |
---|---|---|---|---|---|
C15H9+ | 17.6 ± 0.1 | ? | EI | Dougherty, Bertorello, et al., 1971 | LLK |
C15H11+ | 13.5 ± 0.1 | CH3 | EI | Dougherty, Bertorello, et al., 1971 | LLK |
C15H11+ | 13.10 | CH3 | EI | Nounou, 1968 | RDSH |
C16H10+ | 17.7 ± 0.1 | ? | EI | Dougherty, Bertorello, et al., 1971 | LLK |
C16H13+ | 13.5 ± 0.1 | H | EI | Dougherty, Bertorello, et al., 1971 | LLK |
C16H13+ | 14.2 ± 0.1 | H | EI | Nounou, 1966 | RDSH |

Lee's RI, non-polar column, temperature ramp

Data compiled by: NIST Mass Spectrometry Data Center, William E. Wallace, director

Column type CapillaryCapillaryCapillaryCapillaryCapillary
Active phase DB-5MSHP-5DB-5DB-5SE-52
Column length (m) 30.30.30.30.30.
Carrier gas  Helium
Substrate
Column diameter (mm) 0.250.250.250.250.30
Phase thickness (μm) 0.250.250.250.25
Tstart (C) 50.50.50.50.40.
Tend (C) 300.310.300.300.250.
Heat rate (K/min) 6.6.15.15.4.
Initial hold (min) 2.1.5
Final hold (min) 16.10.
I 338.24338.49339.1339.1337.18
ReferenceSun, Zhou, et al., 2008Pedersen, Durant, et al., 2005Durlak, Biswas, et al., 1998Durlak, Biswas, et al., 1998Wang, Peng, et al., 1997
Comment MSDC-RI MSDC-RI MSDC-RI MSDC-RI MSDC-RI
Column type CapillaryCapillaryCapillaryCapillaryCapillary
Active phase DB-5DB-5CP Sil 8 CBCP Sil 8 CBSE-52
Column length (m) 25.30.50.50.12.
Carrier gas HeHeHeH2He
Substrate
Column diameter (mm) 0.30.320.250.220.3
Phase thickness (μm)  0.250.250.130.34
Tstart (C) 60.50.80.120.50.
Tend (C) 270.300.300.270.250.
Heat rate (K/min) 5.6.4.3.2.
Initial hold (min) 2.2. 2.
Final hold (min)
I 339.01338.63339.9337.70339.23
ReferenceWilliams and Horne, 1995Wang, Fingas, et al., 1994Bundt, Herbel, et al., 1991Garrigues, Parlanti, et al., 1987Lee, Vassilaros, et al., 1979
Comment MSDC-RI MSDC-RI MSDC-RI MSDC-RI MSDC-RI

References

Karnes, Kybett, et al., 1965
Karnes, H.A.; Kybett, B.D.; Wilson, M.H.; Margrave, J.L.; Newman, M.S.,
Strain energies in hydrocarbons from heats of combustion. III. 3,4,5,6- and 2,4,5,7-tetramethylphenanthrenes,
J. Am. Chem. Soc., 1965, 87, 5554-5558. [all data]
Frisch, Barker, et al., 1963
Frisch, M.A.; Barker, C.; Margrave, J.L.; Newman, M.S.,
Strain energies in hydrocarbons from heats to combustion. I. 4,5-and 2,7-dimethylphenanthrenes, 1,12- and 5,8-benzo(c)phenanthrenes and 1',9- and 3',6-benzanthracenes,
J. Am. Chem. Soc., 1963, 85, 2356-2357. [all data]
Frisch, 1962
Frisch, M.A.,
A high precision calorimeter for ther measurement of small energy differences, Ph.D. Thesis for University of Wisconsin, 1962, 1-100. [all data]
Dougherty, Bertorello, et al., 1971
Dougherty, R.C.; Bertorello, H.E.; Martinez de Bertorello, M.,
Mass spectra and thermochemistry of methyl phenanthrenes. A contribution to the analogy between mass spectral and thermal fragmentation reactions,
Org. Mass Spectrom., 1971, 5, 1321. [all data]
Nounou, 1966
Nounou, P.,
Etude des composes aromatiques par spectrometrie de masse. I. Mesure des potentials d'ionisation et d'apparition par la methode du potential retardateur et interpretation des courbes d'ionisation differentielle,
J. Chim. Phys., 1966, 63, 994. [all data]
Nounou, 1968
Nounou, P.,
Etude des composes aromatiques par spectrometrie de masse. III. Interpretation des processus d'ionisation et de dissociation des molecules de phenanthrene et de methyl-phenanthrene par impact electronique,
J. Chim. Phys., 1968, 65, 700. [all data]