3-Penten-1-yne, 3-methyl-
- Formula: C6H8
- Molecular weight: 80.1277
- IUPAC Standard InChIKey: GRGVQLWQXHFRHO-AATRIKPKSA-N
- CAS Registry Number: 1574-33-0
- Chemical structure:
View 3d structure (requires JavaScript / HTML 5) - Other names: 3-Methyl-3-penten-1-yne; 3-methylpent-3-en-1-yne

Gas phase ion energetics data

Data compiled by: Henry M. Rosenstock, Keith Draxl, Bruce W. Steiner, and John T. Herron
Appearance energy determinations
Ion | AE (eV) | Other Products | Method | Reference | Comment |
---|---|---|---|---|---|
C5H5+ | 12.4 | CH3 | EI | Harrison, Haynes, et al., 1965 | |
C6H5+ | 12.7 | H2+H | EI | Harrison, Haynes, et al., 1965 | |
C6H7+ | 10.7 | H | EI | Harrison, Haynes, et al., 1965 |

Phase change data

Data compiled by: Thermodynamics Research Center, NIST Boulder Laboratories, Chris Muzny director
Quantity | Value | Units | Method | Reference | Comment |
---|---|---|---|---|---|
Tboil | 342. | K | N/A | Labarre, 1963 | Uncertainty assigned by TRC = 2. K |

References

Harrison, Haynes, et al., 1965
Harrison, A.G.; Haynes, P.; McLean, S.; Meyer, F.,
The mass spectra of methyl-substituted cyclopentadienes,
J. Am. Chem. Soc., 1965, 87, 5099. [all data]