Spiropentane
- Formula: C5H8
- Molecular weight: 68.1170
- IUPAC Standard InChIKey: OGNAOIGAPPSUMG-UHFFFAOYSA-N
- CAS Registry Number: 157-40-4
- Chemical structure:
View 3d structure (requires JavaScript / HTML 5) - Other names: Spiro[2.2]pentane

Gas phase thermochemistry data

Data compiled as indicated in comments:
ALS - Hussein Y. Afeefy, Joel F. Liebman, and Stephen E. Stein
GT - Glushko Thermocenter, Russian Academy of Sciences, Moscow
Quantity | Value | Units | Method | Reference | Comment |
---|---|---|---|---|---|
ΔfH°gas | 185.1 ± 0.75 | kJ/mol | Cm | Fraser and Prosen, 1955 | ALS |
Quantity | Value | Units | Method | Reference | Comment |
ΔcH°gas | -3296.0 ± 0.71 | kJ/mol | Cm | Fraser and Prosen, 1955 | Corresponding ΔfHºgas = 185.1 kJ/mol (simple calculation by NIST; no Washburn corrections); ALS |
ΔcH°gas | -3258. ± 1.3 | kJ/mol | Ccb | Humphrey and Spitzer, 1950 | Corresponding ΔfHºgas = 147. kJ/mol (simple calculation by NIST; no Washburn corrections); ALS |
Constant pressure heat capacity of gas
Cp,gas (J/mol*K) | Temperature (K) | Reference | Comment |
---|---|---|---|
277.69 ± 0.63 | 283.16 | Scott D.W., 1950 | GT |
282.21 ± 0.63 | 298.16 | ||
286.35 ± 0.63 | 312.14 |
Constant pressure heat capacity of gas
Cp,gas (J/mol*K) | Temperature (K) | Reference | Comment |
---|---|---|---|
88.12 | 298.15 | Scott D.W., 1950 | Heat capacity values calculated using more recent assignment of vibrational frequencies [ Burns G.R., 1975] agree well with those of the [ Scott D.W., 1950].; GT |
88.66 | 300. | ||
119.45 | 400. | ||
146.06 | 500. | ||
167.78 | 600. | ||
185.60 | 700. | ||
200.46 | 800. | ||
213.09 | 900. | ||
223.89 | 1000. | ||
233.17 | 1100. | ||
241.17 | 1200. | ||
248.07 | 1300. | ||
254.09 | 1400. | ||
259.32 | 1500. |

Condensed phase thermochemistry data

Data compiled by: Eugene S. Domalski and Elizabeth D. Hearing
Quantity | Value | Units | Method | Reference | Comment |
---|---|---|---|---|---|
S°liquid | 193.68 | J/mol*K | N/A | Scott, Finke, et al., 1950 |
Constant pressure heat capacity of liquid
Cp,liquid (J/mol*K) | Temperature (K) | Reference | Comment |
---|---|---|---|
134.52 | 298.15 | Scott, Finke, et al., 1950 | T = 12 to 312 K. |

Gas phase ion energetics data

Data evaluated as indicated in comments:
L - Sharon G. Lias
Data compiled as indicated in comments:
LBLHLM - Sharon G. Lias, John E. Bartmess, Joel F. Liebman, John L. Holmes, Rhoda D. Levin, and W. Gary Mallard
LLK - Sharon G. Lias, Rhoda D. Levin, and Sherif A. Kafafi
RDSH - Henry M. Rosenstock, Keith Draxl, Bruce W. Steiner, and John T. Herron
Quantity | Value | Units | Method | Reference | Comment |
---|---|---|---|---|---|
IE (evaluated) | 9.26 | eV | N/A | N/A | L |
Ionization energy determinations
IE (eV) | Method | Reference | Comment |
---|---|---|---|
9.26 | PE | Gleiter, Krennrich, et al., 1986 | LBLHLM |
9.26 | EI | Lossing and Traeger, 1975 | LLK |
9.26 | EI | Holmes, 1974 | LLK |
9.37 ± 0.05 | EI | Puttemans and Delvaux, 1973 | LLK |
9.73 | PE | Gleiter, Krennrich, et al., 1986 | Vertical value; LBLHLM |
9.45 | PE | Dewar and Worley, 1969 | Vertical value; RDSH |
Appearance energy determinations
Ion | AE (eV) | Other Products | Method | Reference | Comment |
---|---|---|---|---|---|
C3H3+ | 13.46 ± 0.15 | C2H4+H | EI | Puttemans and Delvaux, 1973 | LLK |
C3H4+ | 11.17 ± 0.08 | C2H4 | EI | Puttemans and Delvaux, 1973 | LLK |
C4H5+ | 10.20 | CH3 | EI | Holmes, 1974 | LLK |
C4H5+ | 10.65 ± 0.08 | CH3 | EI | Puttemans and Delvaux, 1973 | LLK |
C5H7+ | 9.26 | H | EI | Lossing and Traeger, 1975, 2 | LLK |
C5H7+ | 9.53 | H | EI | Lossing and Traeger, 1975 | LLK |
C5H7+ | 9.53 ± 0.03 | H | EI | Holmes, 1974 | LLK |
C5H7+ | 9.93 ± 0.10 | H | EI | Puttemans and Delvaux, 1973 | LLK |

Phase change data

Data compiled as indicated in comments:
TRC - Thermodynamics Research Center, NIST Boulder Laboratories, Chris Muzny director
AC - William E. Acree, Jr., James S. Chickos
DH - Eugene S. Domalski and Elizabeth D. Hearing
Quantity | Value | Units | Method | Reference | Comment |
---|---|---|---|---|---|
Tboil | 312.1 | K | N/A | Majer and Svoboda, 1985 | |
Tboil | 303.18 | K | N/A | Cleaves and Sherrick, 1946 | Uncertainty assigned by TRC = 0.1 K; same as in 1946 sla 1; TRC |
Tboil | 312.18 | K | N/A | Slabey, 1946 | Uncertainty assigned by TRC = 0.1 K; TRC |
Quantity | Value | Units | Method | Reference | Comment |
Tfus | 166.10 | K | N/A | Cleaves and Sherrick, 1946 | Uncertainty assigned by TRC = 0.1 K; same as in 1946 sla 1; TRC |
Tfus | 166.10 | K | N/A | Slabey, 1946 | Uncertainty assigned by TRC = 0.1 K; TRC |
Quantity | Value | Units | Method | Reference | Comment |
Ttriple | 166.14 | K | N/A | Scott, Finke, et al., 1950, 2 | Uncertainty assigned by TRC = 0.05 K; TRC |
Quantity | Value | Units | Method | Reference | Comment |
Tc | 506.4 | K | N/A | Majer and Svoboda, 1985 | |
Quantity | Value | Units | Method | Reference | Comment |
ΔvapH° | 6.62 | kcal/mol | N/A | Majer and Svoboda, 1985 | |
ΔvapH° | 6.57 ± 0.02 | kcal/mol | C | Scott, Finke, et al., 1950 | AC |
Enthalpy of vaporization
ΔvapH (kcal/mol) | Temperature (K) | Method | Reference | Comment |
---|---|---|---|---|
6.396 | 312.1 | N/A | Majer and Svoboda, 1985 | |
6.3929 | 312.13 | N/A | Scott, Finke, et al., 1950 | P = 101.325 kPa; DH |
6.84 | 291. | A | Stephenson and Malanowski, 1987 | Based on data from 276. to 344. K. See also Scott, Finke, et al., 1950, 3.; AC |
6.76 ± 0.02 | 283. | C | Scott, Finke, et al., 1950 | AC |
6.38 ± 0.02 | 312. | C | Scott, Finke, et al., 1950 | AC |
Enthalpy of vaporization
ΔvapH =
A exp(-βTr) (1 − Tr)β
ΔvapH =
Enthalpy of vaporization (at saturation pressure)
(kcal/mol)
Tr = reduced temperature (T / Tc)
View plot Requires a JavaScript / HTML 5 canvas capable browser.
Temperature (K) | A (kcal/mol) | β | Tc (K) | Reference | Comment |
---|---|---|---|---|---|
283. to 312. | 9.904 | 0.2778 | 506.4 | Majer and Svoboda, 1985 |
Entropy of vaporization
ΔvapS (cal/mol*K) | Temperature (K) | Reference | Comment |
---|---|---|---|
20.48 | 312.13 | Scott, Finke, et al., 1950 | P; DH |
Antoine Equation Parameters
log10(P) = A − (B / (T + C))
P = vapor pressure (atm)
T = temperature (K)
View plot Requires a JavaScript / HTML 5 canvas capable browser.
Temperature (K) | A | B | C | Reference | Comment |
---|---|---|---|---|---|
276.78 to 343.98 | 4.03563 | 1089.801 | -42.079 | Scott, Finke, et al., 1950 | Coefficents calculated by NIST from author's data. |
Enthalpy of fusion
ΔfusH (kcal/mol) | Temperature (K) | Reference | Comment |
---|---|---|---|
1.5376 | 166.14 | Scott, Finke, et al., 1950 | DH |
1.54 | 166.1 | Domalski and Hearing, 1996 | AC |
Entropy of fusion
ΔfusS (cal/mol*K) | Temperature (K) | Reference | Comment |
---|---|---|---|
9.254 | 166.14 | Scott, Finke, et al., 1950 | DH |

References

Fraser and Prosen, 1955
Fraser, F.M.; Prosen, E.J.,
Heats of combustion and isomerization of six pentadienes and spiropentane,
J. Res. NBS, 1955, 54, 143-148. [all data]
Humphrey and Spitzer, 1950
Humphrey, G.I.; Spitzer, R.,
Bond hybridization in the non-tetrahedral carbon atom. The heats of combustion of spiro-pentane and methylcyclobutane,
J. Chem. Phys., 1950, 18, 902. [all data]
Scott D.W., 1950
Scott D.W.,
Spiropentane: heat capacity, heats of fusion and vaporization, vapor pressure, entropy and thermodynamic functions,
J. Am. Chem. Soc., 1950, 72, 4664-4668. [all data]
Burns G.R., 1975
Burns G.R.,
The force field and normal coordinates of spiropentane,
J. Mol. Struct., 1975, 27, 383-390. [all data]
Scott, Finke, et al., 1950
Scott, D.W.; Finke, H.L.; Hubbard, W.N.; McCullough, J.P.; Gross, M.E.; Williamson, K.D.; Waddington, G.; Huffman, H.M.,
Spiropentane: heat capacity, heats of fusion and vaporization, vapor pressure, entropy and thermodynamic functions,
J. Am. Chem. Soc., 1950, 72, 4664-4668. [all data]
Gleiter, Krennrich, et al., 1986
Gleiter, R.; Krennrich, G.; Brinker, U.H.,
Electronic structure of spiropentane and some derivatives,
J. Org. Chem., 1986, 51, 2899. [all data]
Lossing and Traeger, 1975
Lossing, F.P.; Traeger, J.C.,
Stabilization in cyclopentadienyl, cyclopentenyl, and cyclopentyl cations,
J. Am. Chem. Soc., 1975, 97, 1579. [all data]
Holmes, 1974
Holmes, J.L.,
The mass spectra of isomeric hydrocarbons - II: The C5H8 isomers, spiropentane, cyclopentene, 1,3-pentadiene and isoprene; the mechanisms and energetics of their fragmentations,
Org. Mass Spectrom., 1974, 8, 247. [all data]
Puttemans and Delvaux, 1973
Puttemans, J.-P.; Delvaux, J.C.,
Ionisation et fragmentation d'isomeres C5H8 sous impact electronique. Spiropentane - methylenecyclobutane - isoprene,
Ing. Chim. Brussell, 1973, 55(267-8), 7. [all data]
Dewar and Worley, 1969
Dewar, M.J.S.; Worley, S.D.,
Photoelectron spectra of molecules. I. Ionization potentials of some organic molecules and their interpretation,
J. Chem. Phys., 1969, 50, 654. [all data]
Lossing and Traeger, 1975, 2
Lossing, F.P.; Traeger, J.C.,
Free radicals by mass spectrometry XLVI. Heats of formation of C5H7 and C5H9 radicals and cations.,
J. Am. Chem. Soc., 1975, 19, 9. [all data]