Ethen-1,2-diol
- Formula: C2H4O2
- Molecular weight: 60.0520
- IUPAC Standard InChIKey: JMCRDEBJJPRTPV-OWOJBTEDSA-N
- CAS Registry Number: 1571-60-4
- Chemical structure:
View 3d structure (requires JavaScript / HTML 5) - Stereoisomers:

Gas phase ion energetics data

Data compiled as indicated in comments:
LBLHLM - Sharon G. Lias, John E. Bartmess, Joel F. Liebman, John L. Holmes, Rhoda D. Levin, and W. Gary Mallard
Ionization energy determinations
IE (eV) | Method | Reference | Comment |
---|---|---|---|
9.62 ± 0.04 | EI | Turecek and Havlas, 1986 | LBLHLM |

References

Turecek and Havlas, 1986
Turecek, F.; Havlas, Z.,
Energy barriers to the diels-alder cycloadditions and cycloreversions of cation-radicals in the gas phase,
J. Chem. Soc. Perkin Trans. 2, 1986, 1011. [all data]