Chromium, pentacarbonyl(piperidine)-
- Formula: C10H11CrNO5
- Molecular weight: 277.1941
- CAS Registry Number: 15710-39-1

Condensed phase thermochemistry data

Data compiled by: José A. Martinho Simões
Quantity | Value | Units | Method | Reference | Comment |
---|---|---|---|---|---|
ΔfH°solid | -930.1 ± 8.4 | kJ/mol | Review | Martinho Simões | The enthalpy of formation relies on -908.4 ± 2.6 kJ/mol for the enthalpy of formation of Cr(CO)6(g) |

Phase change data

Data compiled as indicated in comments:
MS - José A. Martinho Simões
AC - William E. Acree, Jr., James S. Chickos
Quantity | Value | Units | Method | Reference | Comment |
---|---|---|---|---|---|
ΔsubH° | 93.5 ± 1.9 | kJ/mol | DSC | Daamen, Ernsting, et al., 1979 | MS |
Enthalpy of sublimation
ΔsubH (kJ/mol) | Temperature (K) | Method | Reference | Comment |
---|---|---|---|---|
93.5 ± 1.9 | 282. | ME | Daamen, Ernsting, et al., 1979, 2 | Based on data from 265. to 298. K.; AC |

Gas phase ion energetics data

Data compiled by: Sharon G. Lias, Rhoda D. Levin, and Sherif A. Kafafi
Ionization energy determinations
IE (eV) | Method | Reference | Comment |
---|---|---|---|
7.39 | PE | Daamen and Oskam, 1978 | Vertical value |

Gas phase thermochemistry data

Data compiled by: José A. Martinho Simões
Quantity | Value | Units | Method | Reference | Comment |
---|---|---|---|---|---|
ΔfH°gas | -200.0 ± 2.1 | kcal/mol | Review | Martinho Simões | The enthalpy of formation relies on -217.1 ± 0.62 kcal/mol for the enthalpy of formation of Cr(CO)6(g) |

References

Martinho Simões
Martinho Simões, J.A.,
Private communication (see http://webbook.nist.gov/chemistry/om/). [all data]
Daamen, Ernsting, et al., 1979
Daamen, H.; Ernsting, J.M.; Oskam, A.,
Thermochim. Acta, 1979, 33, 217. [all data]
Daamen, Ernsting, et al., 1979, 2
Daamen, H.; Ernsting, J.M.; Oskam, A.,
Vapour pressure measurements on M(CO)5L (M = Cr, Mo, W; L = piperidine, pyridine, pyrazine, pyrazole, thiazole),
Thermochimica Acta, 1979, 33, 217-223, https://doi.org/10.1016/0040-6031(79)87044-6
. [all data]
Daamen and Oskam, 1978
Daamen, H.; Oskam, A.,
Bonding properties of some monosubstituted chromium and tungsten hexacarbonyls M(CO)5L (L=amine, substituted pyridine, azine),
Inorg. Chim. Acta, 1978, 26, 81. [all data]