Methyl 1-methylcyclopropyl ketone
- Formula: C6H10O
- Molecular weight: 98.1430
- IUPAC Standard InChIKey: OQBCJXUAQQMTRW-UHFFFAOYSA-N
- CAS Registry Number: 1567-75-5
- Chemical structure:
View 3d structure (requires JavaScript / HTML 5) - Other names: Ethanone, 1-(1-methylcyclopropyl)-; (1-Methylcyclopropyl)(methyl)ketone; Ketone, methyl 1-methylcyclopropyl; 1-Acetyl-1-methylcyclopropane

Phase change data

Data compiled by: Robert L. Brown and Stephen E. Stein
Quantity | Value | Units | Method | Reference | Comment |
---|---|---|---|---|---|
Tboil | 399.7 | K | N/A | Aldrich Chemical Company Inc., 1990 | |
Tboil | 398. to 401. | K | N/A | Buckingham and Donaghy, 1982 |
Reduced pressure boiling point
Tboil (K) | Pressure (bar) | Reference |
---|---|---|
325. | 0.055 | Buckingham and Donaghy, 1982 |

Gas phase ion energetics data

Data compiled by: Sharon G. Lias, Rhoda D. Levin, and Sherif A. Kafafi
Ionization energy determinations
IE (eV) | Method | Reference | Comment |
---|---|---|---|
9.3 | PE | Al-Khafaji and Shanshal, 1977 | Vertical value |

References

Aldrich Chemical Company Inc., 1990
Aldrich Chemical Company Inc.,
Catalog Handbook of Fine Chemicals, Aldrich Chemical Company, Inc., Milwaukee WI, 1990, 1. [all data]
Buckingham and Donaghy, 1982
Buckingham, J.; Donaghy, S.M.,
Dictionary of Organic Compounds: Fifth Edition, Chapman and Hall, New York, 1982, 1. [all data]
Al-Khafaji and Shanshal, 1977
Al-Khafaji, J.A.; Shanshal, M.,
The photoelectron spectra of cyclopropyl ketones,
Z. Naturforsch. A:, 1977, 32, 109. [all data]