3,3-Dimethylbutylamine
- Formula: C6H15N
- Molecular weight: 101.1900
- IUPAC Standard InChIKey: GPWHFPWZAPOYNO-UHFFFAOYSA-N
- CAS Registry Number: 15673-00-4
- Chemical structure:
View 3d structure (requires JavaScript / HTML 5) - Other names: 1-Butanamine, 3,3-dimethyl-

Phase change data

Data compiled by: Robert L. Brown and Stephen E. Stein
Quantity | Value | Units | Method | Reference | Comment |
---|---|---|---|---|---|
Tboil | 388.2 | K | N/A | Aldrich Chemical Company Inc., 1990 |

Gas phase ion energetics data

Data compiled by: Sharon G. Lias and Joel F. Liebman
Appearance energy determinations
Ion | AE (eV) | Other Products | Method | Reference | Comment |
---|---|---|---|---|---|
CH4N+ | 9.67 | (CH3)3CCH2 | EI | Holmes, Lossing, et al., 1988 |

References

Aldrich Chemical Company Inc., 1990
Aldrich Chemical Company Inc.,
Catalog Handbook of Fine Chemicals, Aldrich Chemical Company, Inc., Milwaukee WI, 1990, 1. [all data]
Holmes, Lossing, et al., 1988
Holmes, J.L.; Lossing, F.P.; Maccoll, A.,
Heats of formation of alkyl radicals from appearance energies,
J. Am. Chem. Soc., 1988, 110, 7339. [all data]