Ethylene, 1,2-dichloro-, (E)-
- Formula: C2H2Cl2
- Molecular weight: 96.943
- IUPAC Standard InChIKey: KFUSEUYYWQURPO-OWOJBTEDSA-N
- CAS Registry Number: 156-60-5
- Chemical structure:
View 3d structure (requires JavaScript / HTML 5) - Stereoisomers:
- Other names: Ethene, 1,2-dichloro-, (E)-; (E)-1,2-Dichloroethylene; trans-Di-1,2-Chloroethylene; trans-1,2-Dichloroethene; trans-1,2-Dichloroethylene; (E)-CHCl=CHCl; 1,2-trans-Dichloroethene; (E)-1,2-Dichloroethene; 1,2-trans-Dichloroethylene; trans-Acetylene dichloride; trans-Dichloroethylene; Dichloroethylene, trans-; 1,trans-2-Dichloroethene; Rcra waste number U079; Ethene, 1,2-dichloro-, (1E)-; Ethylene, 1,2-dichloro-, trans-; HCC 1130t; NSC 60512; R 1130t

Gas phase thermochemistry data

Data compiled as indicated in comments:
DRB - Donald R. Burgess, Jr.
ALS - Hussein Y. Afeefy, Joel F. Liebman, and Stephen E. Stein
Quantity | Value | Units | Method | Reference | Comment |
---|---|---|---|---|---|
ΔfH°gas | -1. ± 2. | kJ/mol | Review | Manion, 2002 | based on measurements by 1974RLV of equilbrium with 1,1-dichloroethane; DRB |
ΔfH°gas | 1.7 | kJ/mol | Eqk | Rozhnov, Levanova, et al., 1974 | GC; ALS |

Condensed phase thermochemistry data

Data compiled as indicated in comments:
DRB - Donald R. Burgess, Jr.
ALS - Hussein Y. Afeefy, Joel F. Liebman, and Stephen E. Stein
DH - Eugene S. Domalski and Elizabeth D. Hearing
Quantity | Value | Units | Method | Reference | Comment |
---|---|---|---|---|---|
ΔfH°liquid | -30. ± 2.2 | kJ/mol | Review | Manion, 2002 | derived from recommended ΔfHgas° and ΔvapH°; DRB |
ΔfH°liquid | -14.34 | kJ/mol | Eqk | Pitzer and Hollenberg, 1954 | Heat of isomerization at 0K; ALS |
Quantity | Value | Units | Method | Reference | Comment |
ΔcH°liquid | -1095.8 ± 8.4 | kJ/mol | Ccb | Smith, Bjellerup, et al., 1953 | Reanalyzed by Cox and Pilcher, 1970, Original value = -1090. ± 10. kJ/mol; ALS |
Constant pressure heat capacity of liquid
Cp,liquid (J/mol*K) | Temperature (K) | Reference | Comment |
---|---|---|---|
113.0 | 288. | Mehl, 1934 | DH |

Phase change data

Data compiled as indicated in comments:
BS - Robert L. Brown and Stephen E. Stein
TRC - Thermodynamics Research Center, NIST Boulder Laboratories, Chris Muzny director
DRB - Donald R. Burgess, Jr.
ALS - Hussein Y. Afeefy, Joel F. Liebman, and Stephen E. Stein
AC - William E. Acree, Jr., James S. Chickos
Quantity | Value | Units | Method | Reference | Comment |
---|---|---|---|---|---|
Tboil | 321. ± 2. | K | AVG | N/A | Average of 6 values; Individual data points |
Quantity | Value | Units | Method | Reference | Comment |
Tfus | 223. | K | N/A | Broers, Ketelaar, et al., 1950 | Crystal phase 1 phase; Uncertainty assigned by TRC = 0.1 K; TRC |
Quantity | Value | Units | Method | Reference | Comment |
ΔvapH° | 30. ± 1. | kJ/mol | Review | Manion, 2002 | adopted Cox and Pilcher, 1970, 2 recommendation plus a correction for non-ideality; DRB |
ΔvapH° | 29.47 | kJ/mol | V | Ketelaar, Van Velden, et al., 1947 | ALS |
Enthalpy of vaporization
ΔvapH (kJ/mol) | Temperature (K) | Method | Reference | Comment |
---|---|---|---|---|
31.4 | 250. | N/A | Ketelaar, van Velden, et al., 2010 | Based on data from 235. to 358. K.; AC |
29.0 | 336. | A | Stephenson and Malanowski, 1987 | Based on data from 321. to 473. K.; AC |
30.4 | 278. | A | Stephenson and Malanowski, 1987 | Based on data from 263. to 323. K. See also Dykyj, 1970.; AC |
30.1 | 288. | N/A | Machat, 1983 | Based on data from 273. to 319. K.; AC |
Antoine Equation Parameters
log10(P) = A − (B / (T + C))
P = vapor pressure (bar)
T = temperature (K)
View plot Requires a JavaScript / HTML 5 canvas capable browser.
Temperature (K) | A | B | C | Reference | Comment |
---|---|---|---|---|---|
234.96 to 357.99 | 3.94214 | 1064.346 | -50.344 | Ketelaar, van Velden, et al., 1947 | Coefficents calculated by NIST from author's data. |

Reaction thermochemistry data

Data compiled by: Hussein Y. Afeefy, Joel F. Liebman, and Stephen E. Stein
Individual Reactions
By formula: C2H2Cl2 = C2H2Cl2
Quantity | Value | Units | Method | Reference | Comment |
---|---|---|---|---|---|
ΔrH° | -2.0 | kJ/mol | Eqk | Rozhnov, Levanova, et al., 1974 | liquid phase; GC |
ΔrH° | -3.0 ± 0.67 | kJ/mol | Eqk | Craig, Piper, et al., 1971 | gas phase |
ΔrH° | 3.03 | kJ/mol | Eqk | Wood and Stevenson, 1941 | gas phase; Heat of isomerization |
ΔrH° | 2.6 | kJ/mol | Eqk | Maroney, 1935 | gas phase; At 300-975 K |
By formula: C2H2Cl2 = C2H2Cl2
Quantity | Value | Units | Method | Reference | Comment |
---|---|---|---|---|---|
ΔrH° | 0.8 | kJ/mol | Kin | Laursen and Pimentel, 1989 | gas phase; Photolysis |
ΔrH° | 1.8 ± 0.4 | kJ/mol | Eqk | Craig, Piper, et al., 1971 | gas phase |
ΔrH° | 1.86 ± 0.084 | kJ/mol | Eqk | Pitzer and Hollenberg, 1954 | liquid phase; Heat of isomerization at 0K |
By formula: C2H2Cl2 = C2H2Cl2
Quantity | Value | Units | Method | Reference | Comment |
---|---|---|---|---|---|
ΔrH° | -3.5 | kJ/mol | Eqk | Rozhnov, Levanova, et al., 1974 | liquid phase; solvent: Dichloroethylene; GC |
By formula: C2H2Cl2 + Br2 = C2H2Br2Cl2
Quantity | Value | Units | Method | Reference | Comment |
---|---|---|---|---|---|
ΔrH° | -72.4 | kJ/mol | Eqk | Muller and Schumacher, 1939 | gas phase |

Henry's Law data

Data compiled by: Rolf Sander
Henry's Law constant (water solution)
kH(T) = k°H exp(d(ln(kH))/d(1/T) ((1/T) - 1/(298.15 K)))
k°H = Henry's law constant for solubility in water at 298.15 K (mol/(kg*bar))
d(ln(kH))/d(1/T) = Temperature dependence constant (K)
k°H (mol/(kg*bar)) | d(ln(kH))/d(1/T) (K) | Method | Reference | Comment |
---|---|---|---|---|
0.090 | 4100. | L | N/A | |
0.099 | 3400. | M | N/A | |
0.098 | 3300. | X | N/A | |
0.097 | 4100. | X | N/A | |
0.11 | 3400. | X | N/A | |
0.10 | 4000. | M | N/A | |
0.11 | 4300. | X | N/A | |
0.15 | Q | N/A | missing citation give several references for the Henry's law constants but don't assign them to specific species. | |
0.085 | 4800. | X | N/A | |
0.10 | 3000. | X | N/A | |
0.11 | 4200. | M | Gossett, 1987 | |
0.19 | 1700. | X | N/A | |
0.15 | L | N/A | ||
0.070 | 5400. | X | N/A | |
0.15 | V | N/A | ||
0.15 | V | N/A |

Gas phase ion energetics data

Data evaluated as indicated in comments:
L - Sharon G. Lias
Data compiled as indicated in comments:
LBLHLM - Sharon G. Lias, John E. Bartmess, Joel F. Liebman, John L. Holmes, Rhoda D. Levin, and W. Gary Mallard
LLK - Sharon G. Lias, Rhoda D. Levin, and Sherif A. Kafafi
RDSH - Henry M. Rosenstock, Keith Draxl, Bruce W. Steiner, and John T. Herron
Quantity | Value | Units | Method | Reference | Comment |
---|---|---|---|---|---|
IE (evaluated) | 9.64 ± 0.02 | eV | N/A | N/A | L |
Ionization energy determinations
IE (eV) | Method | Reference | Comment |
---|---|---|---|
9.64 | PE | Lake and Thompson, 1970 | RDSH |
9.69 | PE | Jonathan, Ross, et al., 1970 | RDSH |
~9.6 | S | Walsh and Warsop, 1967 | RDSH |
9.66 ± 0.03 | PI | Watanabe, Nakayama, et al., 1962 | RDSH |
9.64 ± 0.02 | PI | Momigny, 1960 | RDSH |
9.63 | PI | Bralsford, Harris, et al., 1960 | RDSH |
9.8 | PE | Von Niessen, Asbrink, et al., 1982 | Vertical value; LBLHLM |
9.80 | PE | Wittel and Bock, 1974 | Vertical value; LLK |
11.92 | PE | Katrib, Debies, et al., 1973 | Vertical value; LLK |
9.72 | PE | Bock and Wittel, 1972 | Vertical value; LLK |
Appearance energy determinations
Ion | AE (eV) | Other Products | Method | Reference | Comment |
---|---|---|---|---|---|
C2HCl+ | 13.39 ± 0.05 | HCl | EI | Momigny, 1961 | RDSH |
C2H2Cl+ | 12.61 ± 0.05 | Cl | EI | Momigny, 1961 | RDSH |

Vibrational and/or electronic energy levels

Data compiled by: Takehiko Shimanouchi
Symmetry: C2h Symmetry Number σ = 2
Sym. | No | Approximate | Selected Freq. | Infrared | Raman | Comments | ||||
---|---|---|---|---|---|---|---|---|---|---|
Species | type of mode | Value | Rating | Value | Phase | Value | Phase | |||
ag | 1 | CH str | 3073 | C | ia | 3073 S p | liq. | |||
ag | 2 | CC str | 1578 | C | ia | 1578 S p | liq. | |||
ag | 3 | CH bend | 1274 | C | ia | 1274 S p | liq. | |||
ag | 4 | CCl str | 846 | C | ia | 846 S p | liq. | |||
ag | 5 | CCCl deform | 350 | C | ia | 350 S p | liq. | |||
au | 6 | CH bend | 900 | B | 899.8 VS | gas | ia | |||
au | 7 | Torsion | 227 | C | 227 M | gas | ia | |||
bg | 8 | CH bend | 763 | B | ia | 763 M dp | liq. | |||
bu | 9 | CH str | 3090 | C | 3090 S | gas | ia | |||
bu | 10 | CH bend | 1200 | B | 1200 S | gas | ia | |||
bu | 11 | CCl str | 828 | B | 828 VS | gas | ia | |||
bu | 12 | CCCl deform | 250 | D | 250 W | gas | ia | |||
Source: Shimanouchi, 1972

References

Manion, 2002
Manion, J.A.,
Evaluated Enthalpies of Formation of the Stable Closed Shell C1 and C2 Chlorinated Hydrocarbons,
J. Phys. Chem. Ref. Data, 2002, 31, 1, 123-172, https://doi.org/10.1063/1.1420703
. [all data]
Rozhnov, Levanova, et al., 1974
Rozhnov, A.M.; Levanova, S.V.; Dvornikova, G.A.; Sadovnikova, S.L.,
Equilibrium of isomerization of dichloroethylenes,
J. Appl. Chem. USSR, 1974, 47, 667-669. [all data]
Pitzer and Hollenberg, 1954
Pitzer, K.S.; Hollenberg, J.L.,
Cis- and trans-dichloroethylenes. The infrared spectra from 130-400 cm.-1 and the thermodynamic properties,
J. Am. Chem. Soc., 1954, 76, 1493-1496. [all data]
Smith, Bjellerup, et al., 1953
Smith, L.; Bjellerup, L.; Krook, S.; Westermark, H.,
Heats of combustion of organic chloro compounds determined by the "quartz wool" method,
Acta Chem. Scand., 1953, 7, 65. [all data]
Cox and Pilcher, 1970
Cox, J.D.; Pilcher, G.,
Thermochemistry of Organic and Organometallic Compounds, Academic Press, New York, 1970, 1-636. [all data]
Mehl, 1934
Mehl, W.,
Die spezifische Wärme einiger flüssiger Kältemittel,
Z. ges. Kalte-Ind., 1934, 41, 152-153. [all data]
Broers, Ketelaar, et al., 1950
Broers, G.H.J.; Ketelaar, J.A.A.; Van Velden, P.F.,
Melting-point Diagram and Hets of Fusion of cis- and trans-1,2-Dichloro-ethene,
Recl. Trav. Chim. Pays-Bas, 1950, 69, 1122. [all data]
Cox and Pilcher, 1970, 2
Cox, J.D.; Pilcher, G.,
Thermochemistry of Organic and Organometallic Compounds, Academic, London, 1970, 636. [all data]
Ketelaar, Van Velden, et al., 1947
Ketelaar, J.A.A.; Van Velden, P.F.; Zalm, P.,
Vapour pressures and heats of vaporization of cis- and trans-1,2-dichloroethene,
Rec. Trav. Chim. Pays/Bas, 1947, 66, 27. [all data]
Ketelaar, van Velden, et al., 2010
Ketelaar, J.A.A.; van Velden, P.F.; Zalm, P.,
Vapour pressures and heats of vaporization of cis- and trans-1,2-dichloroethene,
Recl. Trav. Chim. Pays-Bas, 2010, 66, 12, 721-732, https://doi.org/10.1002/recl.19470661202
. [all data]
Stephenson and Malanowski, 1987
Stephenson, Richard M.; Malanowski, Stanislaw,
Handbook of the Thermodynamics of Organic Compounds, 1987, https://doi.org/10.1007/978-94-009-3173-2
. [all data]
Dykyj, 1970
Dykyj, J.,
Petrochemica, 1970, 10, 2, 51. [all data]
Machat, 1983
Machat, V.,
, Thesis, Utzcht, Prague, 1983. [all data]
Ketelaar, van Velden, et al., 1947
Ketelaar, J.A.A.; van Velden, P.F.; Zalm, P.,
Vapour Pressures and Heats of Vaporization of cis- and trans-1,2-Dichloroethene,
Recl. Trav. Chim. Pays-Bas, 1947, 66, 12, 721-732, https://doi.org/10.1002/recl.19470661202
. [all data]
Craig, Piper, et al., 1971
Craig, N.C.; Piper, L.G.; Wheeler, V.L.,
Thermodynamics of cis-trans isomerizations. II. The 1-chloro-2-fluoroethylenes, 1,2-difluorocyclopropanes, and related molecules,
J. Phys. Chem., 1971, 75, 1453-1460. [all data]
Wood and Stevenson, 1941
Wood, R.E.; Stevenson, D.P.,
The energy of isomerization of cis- and trans-dichloroethylene,
J. Am. Chem. Soc., 1941, 63, 1650-1653. [all data]
Maroney, 1935
Maroney, W.,
The thermal equilibrium of the cis-trans isomers of dichloroethylene at high temperatures,
J. Am. Chem. Soc., 1935, 57, 2397-2398. [all data]
Laursen and Pimentel, 1989
Laursen, S.L.; Pimentel, G.C.,
Matrix-induced intersystem crossing in the photochemistry of the 1,2-dichloroethenes,
J. Phys. Chem., 1989, 93, 2328-2333. [all data]
Muller and Schumacher, 1939
Muller, K.L.; Schumacher, H.J.,
Die photochemische bromierung von transdichlorathylen und der photochemische durch brom sensibilisierte zerfall von dichlordibromathan,
Z. Phys. Chem., 1939, 42, 327-345. [all data]
Gossett, 1987
Gossett, J.M.,
Measurement of Henry's Law Constants for C1 and C2 Chlorinated Hydrocarbons,
Environ. Sci. Technol., 1987, 21, 202-208. [all data]
Lake and Thompson, 1970
Lake, R.F.; Thompson, H.,
Photoelectron spectra of halogenated ethylenes,
Proc. Roy. Soc. (London), 1970, A315, 323. [all data]
Jonathan, Ross, et al., 1970
Jonathan, N.; Ross, K.; Tomlinson, V.,
The photoelectron spectra of dichloroethylenes,
Intern. J. Mass Spectrom. Ion Phys., 1970, 4, 51. [all data]
Walsh and Warsop, 1967
Walsh, A.D.; Warsop, P.A.,
Ultra-violet absorption of trans-dichloro ethylene,
J. Chem. Soc. Faraday Trans., 1967, 63, 524. [all data]
Watanabe, Nakayama, et al., 1962
Watanabe, K.; Nakayama, T.; Mottl, J.,
Ionization potentials of some molecules,
J. Quant. Spectry. Radiative Transfer, 1962, 2, 369. [all data]
Momigny, 1960
Momigny, J.,
Les potentials d'ionisation des dihalogenoethylenes cis et trans,
Bull. Classe Sci. Acad. Roy. Belg., 1960, 46, 686. [all data]
Bralsford, Harris, et al., 1960
Bralsford, R.; Harris, P.V.; Price, W.C.,
The effect of fluorine on the electronic spectra and ionization potentials of molecules,
Proc. Roy. Soc. (London), 1960, A258, 459. [all data]
Von Niessen, Asbrink, et al., 1982
Von Niessen, W.; Asbrink, L.; Bieri, G.,
30.4 nm He(II) Photoelectron spectra of organic molecules. Part VI. Halogeno-compounds (C,H,X: X = Cl, Br, I),
J. Electron Spectrosc. Relat. Phenom., 1982, 26, 173. [all data]
Wittel and Bock, 1974
Wittel, K.; Bock, H.,
Photoelektronenspekten und molekuleigenschaften. XXVII. Chlor- und bromathylene- beispiele fur anderungen in π- und σ-Systemen,
Chem. Ber., 1974, 107, 317. [all data]
Katrib, Debies, et al., 1973
Katrib, A.; Debies, T.P.; Colton, R.J.; Lee, T.H.; Rabalais, J.W.,
The use of differential photoionization cross sections as a function of excitation energy in assigning photoelectron spectra,
Chem. Phys. Lett., 1973, 22, 196. [all data]
Bock and Wittel, 1972
Bock, H.; Wittel, K.,
Photoelectron spectra and molecular properties of trans-dihalogenoethylenes: substituent effects spin-orbit coupling,
J. Chem. Soc., Chem. Commun., 1972, 602. [all data]
Momigny, 1961
Momigny, J.,
Comportement des dihalogenoethylenes cis et trans sous l'impact electronique,
Bull. Soc. Chim. Belges, 1961, 70, 241. [all data]
Shimanouchi, 1972
Shimanouchi, T.,
Tables of Molecular Vibrational Frequencies Consolidated Volume I, National Bureau of Standards, 1972, 1-160. [all data]