Ethylene, 1,2-dichloro-, (Z)-
- Formula: C2H2Cl2
- Molecular weight: 96.943
- IUPAC Standard InChIKey: KFUSEUYYWQURPO-UPHRSURJSA-N
- CAS Registry Number: 156-59-2
- Chemical structure:
View 3d structure (requires JavaScript / HTML 5) - Stereoisomers:
- Other names: Ethene, 1,2-dichloro-, (Z)-; (Z)-1,2-Dichloroethylene; cis-Di-1,2-Chloroethylene; cis-Dichloroethylene; cis-1,2-Dichloroethene; cis-1,2-Dichloroethylene; 1,2-cis-Dichloroethylene; (Z)-CHCl=CHCl; (Z)-1,2-Dichloroethene; 1,2-cis-Dichloroethene; Acetylene dichloride, cis-; 1,cis-2-Dichloroethene; Ethylene, 1,2-dichloro-, cis-; Ethene, 1,2-dichloro-, (1Z)-; HCC 1130c; R 1130c
- Gas phase thermochemistry data
- Condensed phase thermochemistry data
- Phase change data
- Reaction thermochemistry data
- Henry's Law data
- Gas phase ion energetics data
- IR Spectrum
- Mass spectrum (electron ionization)
- UV/Visible spectrum
- Vibrational and/or electronic energy levels
- Gas Chromatography
- References
- Notes

Gas phase thermochemistry data

Data compiled as indicated in comments:
DRB - Donald R. Burgess, Jr.
ALS - Hussein Y. Afeefy, Joel F. Liebman, and Stephen E. Stein
Quantity | Value | Units | Method | Reference | Comment |
---|---|---|---|---|---|
ΔfH°gas | -3. ± 2. | kJ/mol | Review | Manion, 2002 | based on measurements by 1974RLV of equilbrium with 1,1-dichloroethane; DRB |
ΔfH°gas | 4.27 | kJ/mol | Eqk | Rozhnov, Levanova, et al., 1974 | ALS |
ΔfH°gas | 3. | kJ/mol | Cm | Kirkbride, 1956 | Heat of chlorination; ALS |

Condensed phase thermochemistry data

Data compiled as indicated in comments:
DRB - Donald R. Burgess, Jr.
ALS - Hussein Y. Afeefy, Joel F. Liebman, and Stephen E. Stein
DH - Eugene S. Domalski and Elizabeth D. Hearing
Quantity | Value | Units | Method | Reference | Comment |
---|---|---|---|---|---|
ΔfH°liquid | -34.1 ± 2.2 | kJ/mol | Review | Manion, 2002 | derived from recommended ΔfHgas° and ΔvapH°; DRB |
ΔfH°liquid | -28. | kJ/mol | Cm | Kirkbride, 1956 | Heat of chlorination; ALS |
ΔfH°liquid | -13.76 | kJ/mol | Eqk | Pitzer and Hollenberg, 1954 | Heat of isomerization at 0K; ALS |
Quantity | Value | Units | Method | Reference | Comment |
ΔcH°liquid | -1093.7 ± 8.4 | kJ/mol | Ccb | Smith, Bjellerup, et al., 1953 | Reanalyzed by Cox and Pilcher, 1970, Original value = -1092. ± 8. kJ/mol; ALS |
Constant pressure heat capacity of liquid
Cp,liquid (J/mol*K) | Temperature (K) | Reference | Comment |
---|---|---|---|
113.8 | 288. | Mehl, 1934 | DH |

Phase change data

Data compiled as indicated in comments:
BS - Robert L. Brown and Stephen E. Stein
TRC - Thermodynamics Research Center, NIST Boulder Laboratories, Chris Muzny director
DRB - Donald R. Burgess, Jr.
ALS - Hussein Y. Afeefy, Joel F. Liebman, and Stephen E. Stein
AC - William E. Acree, Jr., James S. Chickos
Quantity | Value | Units | Method | Reference | Comment |
---|---|---|---|---|---|
Tboil | 333.5 | K | N/A | Weast and Grasselli, 1989 | BS |
Tboil | 333.5 | K | N/A | Amaya, 1961 | Uncertainty assigned by TRC = 0.4 K; TRC |
Tboil | 333.2 | K | N/A | Andrews and Keefer, 1951 | Uncertainty assigned by TRC = 0.6 K; TRC |
Tboil | 333.5 | K | N/A | Maryott, Hobbs, et al., 1941 | Uncertainty assigned by TRC = 0.3 K; TRC |
Tboil | 333.0 | K | N/A | Awbery and Griffiths, 1936 | Uncertainty assigned by TRC = 2. K; estimate based on distillation curve; TRC |
Quantity | Value | Units | Method | Reference | Comment |
Tfus | 193. | K | N/A | Broers, Ketelaar, et al., 1950 | Crystal phase 1 phase; Uncertainty assigned by TRC = 0.1 K; TRC |
Quantity | Value | Units | Method | Reference | Comment |
ΔvapH° | 31. ± 1. | kJ/mol | Review | Manion, 2002 | adopted Cox and Pilcher, 1970, 2 recommendation plus a correction for non-ideality; DRB |
ΔvapH° | 30.90 | kJ/mol | V | Ketelaar, Van Velden, et al., 1947 | ALS |
Enthalpy of vaporization
ΔvapH (kJ/mol) | Temperature (K) | Method | Reference | Comment |
---|---|---|---|---|
31.8 | 288. | N/A | Ketelaar, van Velden, et al., 2010 | Based on data from 273. to 356. K.; AC |
29.3 | 347. | A | Stephenson and Malanowski, 1987 | Based on data from 332. to 495. K.; AC |
31.5 | 288. | A | Stephenson and Malanowski, 1987 | Based on data from 273. to 334. K. See also Dykyj, 1970.; AC |
31.6 | 307. | N/A | Flom, Alpert, et al., 1951 | Based on data from 292. to 335. K.; AC |
Antoine Equation Parameters
log10(P) = A − (B / (T + C))
P = vapor pressure (bar)
T = temperature (K)
View plot Requires a JavaScript / HTML 5 canvas capable browser.
Temperature (K) | A | B | C | Reference | Comment |
---|---|---|---|---|---|
273.91 to 356.78 | 4.0690 | 1163.729 | -47.174 | Ketelaar, van Velden, et al., 1947 | Coefficents calculated by NIST from author's data. |

Reaction thermochemistry data

Data compiled by: Hussein Y. Afeefy, Joel F. Liebman, and Stephen E. Stein
Individual Reactions
By formula: C2H2Cl2 = C2H2Cl2
Quantity | Value | Units | Method | Reference | Comment |
---|---|---|---|---|---|
ΔrH° | -2.0 | kJ/mol | Eqk | Rozhnov, Levanova, et al., 1974 | liquid phase; GC |
ΔrH° | -3.0 ± 0.67 | kJ/mol | Eqk | Craig, Piper, et al., 1971 | gas phase |
ΔrH° | 3.03 | kJ/mol | Eqk | Wood and Stevenson, 1941 | gas phase; Heat of isomerization |
ΔrH° | 2.6 | kJ/mol | Eqk | Maroney, 1935 | gas phase; At 300-975 K |
By formula: C2H2Cl2 = C2H2Cl2
Quantity | Value | Units | Method | Reference | Comment |
---|---|---|---|---|---|
ΔrH° | 0.8 | kJ/mol | Kin | Laursen and Pimentel, 1989 | gas phase; Photolysis |
ΔrH° | 1.8 ± 0.4 | kJ/mol | Eqk | Craig, Piper, et al., 1971 | gas phase |
ΔrH° | 1.86 ± 0.084 | kJ/mol | Eqk | Pitzer and Hollenberg, 1954 | liquid phase; Heat of isomerization at 0K |
By formula: C2H2Cl2 = C2H2Cl2
Quantity | Value | Units | Method | Reference | Comment |
---|---|---|---|---|---|
ΔrH° | -5.52 | kJ/mol | Eqk | Rozhnov, Levanova, et al., 1974 | liquid phase; solvent: Dichloromethylene; GC |
By formula: C2H2Cl2 + Cl2 = C2H2Cl4
Quantity | Value | Units | Method | Reference | Comment |
---|---|---|---|---|---|
ΔrH° | -169. | kJ/mol | Cm | Kirkbride, 1956 | liquid phase; Heat of chlorination |
By formula: C2H2Cl2 = H2 + C2Cl2
Quantity | Value | Units | Method | Reference | Comment |
---|---|---|---|---|---|
ΔrH° | 16. | kJ/mol | Kin | Laursen and Pimentel, 1989 | gas phase; Photolysis |
By formula: C2H2Cl2 = C2HCl + HCl
Quantity | Value | Units | Method | Reference | Comment |
---|---|---|---|---|---|
ΔrH° | 9.6 | kJ/mol | Kin | Laursen and Pimentel, 1989 | gas phase; Photolysis |
By formula: C2H2Cl2 = C2H2 + Cl2
Quantity | Value | Units | Method | Reference | Comment |
---|---|---|---|---|---|
ΔrH° | 21. | kJ/mol | Kin | Laursen and Pimentel, 1989 | gas phase; Photolyses |
By formula: C2H2Cl2 + HCl = C2H3Cl3
Quantity | Value | Units | Method | Reference | Comment |
---|---|---|---|---|---|
ΔrH° | -61.1 | kJ/mol | Cm | Levanova, Treger, et al., 1975 | liquid phase |

Henry's Law data

Data compiled by: Rolf Sander
Henry's Law constant (water solution)
kH(T) = k°H exp(d(ln(kH))/d(1/T) ((1/T) - 1/(298.15 K)))
k°H = Henry's law constant for solubility in water at 298.15 K (mol/(kg*bar))
d(ln(kH))/d(1/T) = Temperature dependence constant (K)
k°H (mol/(kg*bar)) | d(ln(kH))/d(1/T) (K) | Method | Reference | Comment |
---|---|---|---|---|
0.24 | 3900. | L | N/A | |
0.26 | 3400. | X | N/A | |
0.24 | 3800. | M | N/A | |
0.23 | 4000. | X | N/A | |
0.13 | Q | N/A | missing citation give several references for the Henry's law constants but don't assign them to specific species. | |
0.25 | 4200. | X | N/A | |
0.21 | 3100. | X | N/A | |
0.27 | 4200. | M | Gossett, 1987 | |
0.13 | L | N/A | ||
0.22 | 4100. | X | N/A | |
0.13 | V | N/A | ||
0.30 | V | N/A |

Gas phase ion energetics data

Data evaluated as indicated in comments:
L - Sharon G. Lias
Data compiled as indicated in comments:
LBLHLM - Sharon G. Lias, John E. Bartmess, Joel F. Liebman, John L. Holmes, Rhoda D. Levin, and W. Gary Mallard
LLK - Sharon G. Lias, Rhoda D. Levin, and Sherif A. Kafafi
RDSH - Henry M. Rosenstock, Keith Draxl, Bruce W. Steiner, and John T. Herron
Quantity | Value | Units | Method | Reference | Comment |
---|---|---|---|---|---|
IE (evaluated) | 9.66 ± 0.01 | eV | N/A | N/A | L |
Ionization energy determinations
IE (eV) | Method | Reference | Comment |
---|---|---|---|
9.65 | PE | Lake and Thompson, 1970 | RDSH |
9.68 | PE | Jonathan, Ross, et al., 1970 | RDSH |
9.66 | S | Walsh and Warsop, 1968 | RDSH |
9.65 ± 0.01 | PI | Watanabe, Nakayama, et al., 1962 | RDSH |
9.66 ± 0.02 | PI | Momigny, 1960 | RDSH |
9.65 | PI | Bralsford, Harris, et al., 1960 | RDSH |
9.8 | PE | Von Niessen, Asbrink, et al., 1982 | Vertical value; LBLHLM |
9.80 | PE | Wittel and Bock, 1974 | Vertical value; LLK |
Appearance energy determinations
Ion | AE (eV) | Other Products | Method | Reference | Comment |
---|---|---|---|---|---|
C2HCl+ | 13.27 ± 0.05 | HCl | EI | Momigny, 1961 | RDSH |
C2H2Cl+ | 12.29 ± 0.05 | Cl | EI | Momigny, 1961 | RDSH |

Vibrational and/or electronic energy levels

Data compiled by: Takehiko Shimanouchi
Symmetry: C2ν Symmetry Number σ = 2
Sym. | No | Approximate | Selected Freq. | Infrared | Raman | Comments | ||||
---|---|---|---|---|---|---|---|---|---|---|
Species | type of mode | Value | Rating | Value | Phase | Value | Phase | |||
a1 | 1 | CH str | 3077 | C | 3077 | liq. | ||||
a1 | 2 | CC str | 1587 | C | 1590 S | liq. | 1587 S p | liq. | ||
a1 | 3 | CH bend | 1179 | C | 1183 W | liq. | 1179 S p | liq. | ||
a1 | 4 | CCl str | 711 | C | 714 S | liq. | 711 S p | liq. | ||
a1 | 5 | CCCl deform | 173 | C | 173 S p | liq. | ||||
a2 | 6 | CH bend | 876 | C | ia | 876 W dp | liq. | |||
a2 | 7 | Torsion | 406 | C | ia | 406 S dp | liq. | |||
b1 | 8 | CH str | 3072 | C | 3072 | gas | ||||
b1 | 9 | CH bend | 1303 | C | 1303 | gas | ||||
b1 | 10 | CCl str | 857 | B | 857 | gas | ||||
b1 | 11 | CCCl deform | 571 | B | 571 | gas | 563 M dp | liq. | ||
b2 | 12 | CH bend | 697 | B | 697 | gas | ||||
Source: Shimanouchi, 1972

Kovats' RI, non-polar column, isothermal

Column type | Active phase | Temperature (C) | I | Reference | Comment |
---|---|---|---|---|---|
Capillary | OV-1 | 70. | 597. | Annino and Villalobos, 1999 | 22.6 m/0.53 mm/2.78 μm |
Packed | OV-1 | 100. | 598. | Castello and Gerbino, 1988 | He, Chromosorb W DMCS; Column length: 3. m |
Packed | OV-1 | 125. | 598. | Castello and Gerbino, 1988 | He, Chromosorb W DMCS; Column length: 3. m |
Packed | OV-1 | 75. | 597. | Castello and Gerbino, 1988 | He, Chromosorb W DMCS; Column length: 3. m |

Kovats' RI, polar column, isothermal

Column type | Active phase | Temperature (C) | I | Reference | Comment |
---|---|---|---|---|---|
Capillary | Carbowax 20M | 70. | 1010. | Annino and Villalobos, 1999 | 31.3 m/0.53 mm/0.54 μm |
Packed | SP-1000 | 100. | 1003.6 | Castello and Gerbino, 1988 | He, Chromosorb W DMCS; Column length: 3. m |
Packed | SP-1000 | 125. | 1003.47 | Castello and Gerbino, 1988 | He, Chromosorb W DMCS; Column length: 3. m |
Packed | SP-1000 | 75. | 998.32 | Castello and Gerbino, 1988 | He, Chromosorb W DMCS; Column length: 3. m |

Van Den Dool and Kratz RI, non-polar column, temperature ramp

Column type | Active phase | I | Reference | Comment |
---|---|---|---|---|
Capillary | Petrocol DH | 588. | White, Hackett, et al., 1992 | 100. m/0.25 mm/0.5 μm, He, 1. K/min; Tstart: 30. C; Tend: 220. C |
Capillary | SE-54 | 609. | Weber, 1986 | 25. m/0.31 mm/0.17 μm, H2, 2. K/min; Tstart: 35. C |

Normal alkane RI, non-polar column, isothermal

Column type | Active phase | Temperature (C) | I | Reference | Comment |
---|---|---|---|---|---|
Capillary | DB-1 | 60. | 592. | Shimadzu, 2003 | 60. m/0.32 mm/1. μm, He |

Normal alkane RI, non-polar column, temperature ramp

Column type | Active phase | I | Reference | Comment |
---|---|---|---|---|
Capillary | HP-5 MS | 608. | Kotowska, Zalikowski, et al., 2012 | 30. m/0.25 mm/0.25 μm, Helium, 35. C @ 5. min, 3. K/min, 300. C @ 15. min |
Capillary | BP-1 | 592. | Health Safety Executive, 2000 | 50. m/0.22 mm/0.75 μm, He, 5. K/min; Tstart: 50. C; Tend: 200. C |
Capillary | SE-54 | 578. | Huang, Liang, et al., 1996 | 36. m/0.25 mm/0.25 μm, 5. K/min; Tstart: 35. C; Tend: 240. C |

Normal alkane RI, non-polar column, custom temperature program

Column type | Active phase | I | Reference | Comment |
---|---|---|---|---|
Capillary | Polydimethyl siloxanes | 596. | Zenkevich, 2003 | Program: not specified |
Capillary | Methyl Silicone | 596. | Zenkevich, 2001 | Program: not specified |
Capillary | DB-5 | 616. | Sorimachi, Tanabe, et al., 1995 | He; Column length: 30. m; Program: not specified |

Normal alkane RI, polar column, isothermal

Column type | Active phase | Temperature (C) | I | Reference | Comment |
---|---|---|---|---|---|
Capillary | DB-Wax | 60. | 1010. | Shimadzu, 2003 | 50. m/0.32 mm/1. μm, He |

References

Manion, 2002
Manion, J.A.,
Evaluated Enthalpies of Formation of the Stable Closed Shell C1 and C2 Chlorinated Hydrocarbons,
J. Phys. Chem. Ref. Data, 2002, 31, 1, 123-172, https://doi.org/10.1063/1.1420703
. [all data]
Rozhnov, Levanova, et al., 1974
Rozhnov, A.M.; Levanova, S.V.; Dvornikova, G.A.; Sadovnikova, S.L.,
Equilibrium of isomerization of dichloroethylenes,
J. Appl. Chem. USSR, 1974, 47, 667-669. [all data]
Kirkbride, 1956
Kirkbride, F.W.,
The heats of chlorination of some hydrocarbons and their chloro-derivatives,
J. Appl. Chem., 1956, 6, 11-21. [all data]
Pitzer and Hollenberg, 1954
Pitzer, K.S.; Hollenberg, J.L.,
Cis- and trans-dichloroethylenes. The infrared spectra from 130-400 cm.-1 and the thermodynamic properties,
J. Am. Chem. Soc., 1954, 76, 1493-1496. [all data]
Smith, Bjellerup, et al., 1953
Smith, L.; Bjellerup, L.; Krook, S.; Westermark, H.,
Heats of combustion of organic chloro compounds determined by the "quartz wool" method,
Acta Chem. Scand., 1953, 7, 65. [all data]
Cox and Pilcher, 1970
Cox, J.D.; Pilcher, G.,
Thermochemistry of Organic and Organometallic Compounds, Academic Press, New York, 1970, 1-636. [all data]
Mehl, 1934
Mehl, W.,
Die spezifische Wärme einiger flüssiger Kältemittel,
Z. ges. Kalte-Ind., 1934, 41, 152-153. [all data]
Weast and Grasselli, 1989
CRC Handbook of Data on Organic Compounds, 2nd Editon, Weast,R.C and Grasselli, J.G., ed(s)., CRC Press, Inc., Boca Raton, FL, 1989, 1. [all data]
Amaya, 1961
Amaya, K.,
Thermodynamical studies on bionary systems consisting of polar and non-polar liquids. II. the measurement of the heats of mixing for binary systems of polar and non-polar liquids,
Bull. Chem. Soc. Jpn., 1961, 34, 1278. [all data]
Andrews and Keefer, 1951
Andrews, L.J.; Keefer, R.M.,
The Argentation of Organic Iodides,
J. Am. Chem. Soc., 1951, 73, 5733-5736. [all data]
Maryott, Hobbs, et al., 1941
Maryott, A.A.; Hobbs, M.E.; Gross, P.M.,
Bond Moment Additivity and the Electric Moments of Some Halogenated Hydrocarbons,
J. Am. Chem. Soc., 1941, 63, 659. [all data]
Awbery and Griffiths, 1936
Awbery, J.H.; Griffiths, E.,
The Viscosities of Some Liquid Refrigerants,
Proc. Phys. Soc. London, 1936, 48, 372-80. [all data]
Broers, Ketelaar, et al., 1950
Broers, G.H.J.; Ketelaar, J.A.A.; Van Velden, P.F.,
Melting-point Diagram and Hets of Fusion of cis- and trans-1,2-Dichloro-ethene,
Recl. Trav. Chim. Pays-Bas, 1950, 69, 1122. [all data]
Cox and Pilcher, 1970, 2
Cox, J.D.; Pilcher, G.,
Thermochemistry of Organic and Organometallic Compounds, Academic, London, 1970, 636. [all data]
Ketelaar, Van Velden, et al., 1947
Ketelaar, J.A.A.; Van Velden, P.F.; Zalm, P.,
Vapour pressures and heats of vaporization of cis- and trans-1,2-dichloroethene,
Rec. Trav. Chim. Pays/Bas, 1947, 66, 27. [all data]
Ketelaar, van Velden, et al., 2010
Ketelaar, J.A.A.; van Velden, P.F.; Zalm, P.,
Vapour pressures and heats of vaporization of cis- and trans-1,2-dichloroethene,
Recl. Trav. Chim. Pays-Bas, 2010, 66, 12, 721-732, https://doi.org/10.1002/recl.19470661202
. [all data]
Stephenson and Malanowski, 1987
Stephenson, Richard M.; Malanowski, Stanislaw,
Handbook of the Thermodynamics of Organic Compounds, 1987, https://doi.org/10.1007/978-94-009-3173-2
. [all data]
Dykyj, 1970
Dykyj, J.,
Petrochemica, 1970, 10, 2, 51. [all data]
Flom, Alpert, et al., 1951
Flom, Donald G.; Alpert, Norman; Elving, Philip J.,
Systems Involving cis-or trans-Dichloroethylene and an Acetal or Ether,
Ind. Eng. Chem., 1951, 43, 5, 1178-1181, https://doi.org/10.1021/ie50497a051
. [all data]
Ketelaar, van Velden, et al., 1947
Ketelaar, J.A.A.; van Velden, P.F.; Zalm, P.,
Vapour Pressures and Heats of Vaporization of cis- and trans-1,2-Dichloroethene,
Recl. Trav. Chim. Pays-Bas, 1947, 66, 12, 721-732, https://doi.org/10.1002/recl.19470661202
. [all data]
Craig, Piper, et al., 1971
Craig, N.C.; Piper, L.G.; Wheeler, V.L.,
Thermodynamics of cis-trans isomerizations. II. The 1-chloro-2-fluoroethylenes, 1,2-difluorocyclopropanes, and related molecules,
J. Phys. Chem., 1971, 75, 1453-1460. [all data]
Wood and Stevenson, 1941
Wood, R.E.; Stevenson, D.P.,
The energy of isomerization of cis- and trans-dichloroethylene,
J. Am. Chem. Soc., 1941, 63, 1650-1653. [all data]
Maroney, 1935
Maroney, W.,
The thermal equilibrium of the cis-trans isomers of dichloroethylene at high temperatures,
J. Am. Chem. Soc., 1935, 57, 2397-2398. [all data]
Laursen and Pimentel, 1989
Laursen, S.L.; Pimentel, G.C.,
Matrix-induced intersystem crossing in the photochemistry of the 1,2-dichloroethenes,
J. Phys. Chem., 1989, 93, 2328-2333. [all data]
Levanova, Treger, et al., 1975
Levanova, S.V.; Treger, Yu.A.; Velichko, S.M.; Rozhnov, A.M.; Khlestkov, A.I.; Pisarev, V.V.,
Liquid-phase hydrochlorination of symmetrical dichloroethylenes,
J. Appl. Chem. USSR, 1975, 48, 1628-1631, In original 1574. [all data]
Gossett, 1987
Gossett, J.M.,
Measurement of Henry's Law Constants for C1 and C2 Chlorinated Hydrocarbons,
Environ. Sci. Technol., 1987, 21, 202-208. [all data]
Lake and Thompson, 1970
Lake, R.F.; Thompson, H.,
Photoelectron spectra of halogenated ethylenes,
Proc. Roy. Soc. (London), 1970, A315, 323. [all data]
Jonathan, Ross, et al., 1970
Jonathan, N.; Ross, K.; Tomlinson, V.,
The photoelectron spectra of dichloroethylenes,
Intern. J. Mass Spectrom. Ion Phys., 1970, 4, 51. [all data]
Walsh and Warsop, 1968
Walsh, A.D.; Warsop, P.A.,
Ultra-violet absorption spectrum of cis-1,2-dichloro ethylene,
J. Chem. Soc. Faraday Trans., 1968, 64, 1418. [all data]
Watanabe, Nakayama, et al., 1962
Watanabe, K.; Nakayama, T.; Mottl, J.,
Ionization potentials of some molecules,
J. Quant. Spectry. Radiative Transfer, 1962, 2, 369. [all data]
Momigny, 1960
Momigny, J.,
Les potentials d'ionisation des dihalogenoethylenes cis et trans,
Bull. Classe Sci. Acad. Roy. Belg., 1960, 46, 686. [all data]
Bralsford, Harris, et al., 1960
Bralsford, R.; Harris, P.V.; Price, W.C.,
The effect of fluorine on the electronic spectra and ionization potentials of molecules,
Proc. Roy. Soc. (London), 1960, A258, 459. [all data]
Von Niessen, Asbrink, et al., 1982
Von Niessen, W.; Asbrink, L.; Bieri, G.,
30.4 nm He(II) Photoelectron spectra of organic molecules. Part VI. Halogeno-compounds (C,H,X: X = Cl, Br, I),
J. Electron Spectrosc. Relat. Phenom., 1982, 26, 173. [all data]
Wittel and Bock, 1974
Wittel, K.; Bock, H.,
Photoelektronenspekten und molekuleigenschaften. XXVII. Chlor- und bromathylene- beispiele fur anderungen in π- und σ-Systemen,
Chem. Ber., 1974, 107, 317. [all data]
Momigny, 1961
Momigny, J.,
Comportement des dihalogenoethylenes cis et trans sous l'impact electronique,
Bull. Soc. Chim. Belges, 1961, 70, 241. [all data]
Perkampus and Braunschweig, 1966
Perkampus, H.-H.; Braunschweig, T.H.,
UV atlas of organic compounds, 1966, 1, A1/4. [all data]
Shimanouchi, 1972
Shimanouchi, T.,
Tables of Molecular Vibrational Frequencies Consolidated Volume I, National Bureau of Standards, 1972, 1-160. [all data]
Annino and Villalobos, 1999
Annino, R.; Villalobos, R.,
A strategy for the simplification and solution of complex chromatographic analysis problems utilizing two-dimensional mapping of retention indexes followed by computer modeling of heart cuts from serially coupled columns containing different stationary phases,
J. Hi. Res. Chromatogr., 1999, 22, 10, 589-593. [all data]
Castello and Gerbino, 1988
Castello, G.; Gerbino, T.C.,
Effect of Temperature on the Gas Chromatographic Separation of Halogenated Compounds on Polar and Non-Polar Stationary Phases,
J. Chromatogr., 1988, 437, 33-45, https://doi.org/10.1016/S0021-9673(00)90369-8
. [all data]
White, Hackett, et al., 1992
White, C.M.; Hackett, J.; Anderson, R.R.; Kail, S.; Spock, P.S.,
Linear temperature programmed retention indices of gasoline range hydrocarbons and chlorinated hydrocarbons on cross-linked polydimethylsiloxane,
J. Hi. Res. Chromatogr., 1992, 15, 2, 105-120, https://doi.org/10.1002/jhrc.1240150211
. [all data]
Weber, 1986
Weber, L.,
Utilization of the Sadtler standard RI system in micropollution analyses,
J. Hi. Res. Chromatogr. Chromatogr. Comm., 1986, 9, 8, 446-451, https://doi.org/10.1002/jhrc.1240090806
. [all data]
Shimadzu, 2003
Shimadzu,
Gas chromatography analysis of organic solvents using capillary columns (No. 3), 2003, retrieved from http://www.shimadzu.com/apps/form.cfm. [all data]
Kotowska, Zalikowski, et al., 2012
Kotowska, U.; Zalikowski, M.; Isidorov, V.A.,
HS-SPME/GC-MS analysis of volatile and semi-volatile organic compounds emitted from municipal sewage sludge,
Environ. Monit. Asses., 2012, 184, 5, 2893-2907, https://doi.org/10.1007/s10661-011-2158-8
. [all data]
Health Safety Executive, 2000
Health Safety Executive,
MDHS 96 Volatile organic compounds in air - Laboratory method using pumed solid sorbent tubes, solvent desorption and gas chromatography
in Methods for the Determination of Hazardous Substances (MDHS) guidance, Crown, Colegate, Norwich, 2000, 1-24, retrieved from http://www.hse.gov.uk/pubns/mdhs/pdfs/mdhs96.pdf. [all data]
Huang, Liang, et al., 1996
Huang, C.; Liang, H.; Han, S.,
The analysis of organic compounds in waste water by gas extraction/thermal desorption/gas chromatography-mass spectrometry,
Chin. J. Chromatogr., 1996, 14, 6, 421-424. [all data]
Zenkevich, 2003
Zenkevich, I.G.,
Criteria for Evaluation of Elution Order of Isomeric Organic Compounds,
Zh. Phys. Khim. (Rus.), 2003, 77, 1, 92-98. [all data]
Zenkevich, 2001
Zenkevich, I.G.,
Comparative Characterization of Conditions for Unambuguous Chromatographic Identification of Organic Compounds,
Zh. Anal. Khim., 2001, 56, 9, 915-924. [all data]
Sorimachi, Tanabe, et al., 1995
Sorimachi, J.; Tanabe, A.; Mitobe, H.; Kuniaki, K.; Masaaki, S.,
Programmed temperature retention indices for volatile organic compounds on headspace GC/MS analysis,
Niigata-ken Eisei Kogai Kenkyusho Nenpo, 1995, 11, 75-79. [all data]